ACCESSION: MSBNK-Fac_Eng_Univ_Tokyo-JP008354
RECORD_TITLE: BENZOPHENONE; EI-B; MS
DATE: 2016.01.19 (Created 2008.10.21, modified 2011.05.06)
AUTHORS: UBE SCIENTIFIC ANALYSIS LABORATORY
LICENSE: CC BY-NC-SA

CH$NAME: BENZOPHENONE
CH$NAME: DIPHENYL KETONE
CH$COMPOUND_CLASS: N/A
CH$FORMULA: C13H10O
CH$EXACT_MASS: 182.07316
CH$SMILES: c(c2)ccc(c2)C(=O)c(c1)cccc1
CH$IUPAC: InChI=1S/C13H10O/c14-13(11-7-3-1-4-8-11)12-9-5-2-6-10-12/h1-10H
CH$LINK: INCHIKEY RWCCWEUUXYIKHB-UHFFFAOYSA-N
CH$LINK: COMPTOX DTXSID0021961

AC$INSTRUMENT: HITACHI M-60
AC$INSTRUMENT_TYPE: EI-B
AC$MASS_SPECTROMETRY: MS_TYPE MS
AC$MASS_SPECTROMETRY: ION_MODE POSITIVE
AC$MASS_SPECTROMETRY: IONIZATION_ENERGY 70 eV

MS$FOCUSED_ION: ION_TYPE [M]+*

PK$SPLASH: splash10-0a6r-6900000000-7c028c0aa3b44d2ee6be
PK$NUM_PEAK: 20
PK$PEAK: m/z int. rel.int.
  27 1.37 14
  39 1.5 15
  50 8.45 85
  51 31.02 310
  52 2.25 23
  63 1.59 16
  74 3.14 31
  75 3.03 30
  76 4.98 50
  77 62.82 628
  78 5.45 55
  105 99.99 999
  106 7.13 71
  151 1.12 11
  152 2.78 28
  153 1.76 18
  154 1.7 17
  181 6.02 60
  182 46.24 462
  183 6.79 68