ACCESSION: MSBNK-Fac_Eng_Univ_Tokyo-JP008729
RECORD_TITLE: GAMMA-NONALACTONE; EI-B; MS
DATE: 2016.01.19 (Created 2008.10.21, modified 2011.05.06)
AUTHORS: SODA AROMATIC CO., LTD.
LICENSE: CC BY-NC-SA

CH$NAME: GAMMA-NONALACTONE
CH$COMPOUND_CLASS: N/A
CH$FORMULA: C9H16O2
CH$EXACT_MASS: 156.11503
CH$SMILES: CCCCCC(C1)OC(=O)C1
CH$IUPAC: InChI=1S/C9H16O2/c1-2-3-4-5-8-6-7-9(10)11-8/h8H,2-7H2,1H3
CH$LINK: INCHIKEY OALYTRUKMRCXNH-UHFFFAOYSA-N
CH$LINK: COMPTOX DTXSID0034229

AC$INSTRUMENT: HITACHI M-80B
AC$INSTRUMENT_TYPE: EI-B
AC$MASS_SPECTROMETRY: MS_TYPE MS
AC$MASS_SPECTROMETRY: ION_MODE POSITIVE
AC$MASS_SPECTROMETRY: IONIZATION_ENERGY 70 eV

MS$FOCUSED_ION: ION_TYPE [M]+*

PK$SPLASH: splash10-000i-9000000000-b49a9ba5068e6a6f37e2
PK$NUM_PEAK: 31
PK$PEAK: m/z int. rel.int.
  26 1.2 12
  27 13.16 132
  28 5.41 54
  29 23.83 238
  39 5.77 58
  41 12.21 122
  42 4.42 44
  43 7.41 74
  44 1.29 13
  53 1.28 13
  54 1.6 16
  55 8 80
  56 8.1 81
  57 5.14 51
  67 1.21 12
  69 2.08 21
  70 2.25 23
  71 1.62 16
  72 1.95 20
  83 1.62 16
  84 1.96 20
  85 99.99 999
  86 4.14 41
  96 1.49 15
  97 1.1 11
  99 2.09 21
  100 4.17 42
  101 1.59 16
  114 2.41 24
  128 2.26 23
  138 1.14 11