ACCESSION: MSBNK-Fac_Eng_Univ_Tokyo-JP008928
RECORD_TITLE: ETHYLENE GLYCOL; EI-B; MS
DATE: 2016.01.19 (Created 2008.10.21, modified 2011.05.06)
AUTHORS: YAMAMOTO M, DEP. CHEMISTRY, FAC. SCIENCE, NARA WOMEN'S UNIV.
LICENSE: CC BY-NC-SA

CH$NAME: ETHYLENE GLYCOL
CH$COMPOUND_CLASS: N/A
CH$FORMULA: C2H6O2
CH$EXACT_MASS: 62.03678
CH$SMILES: OCCO
CH$IUPAC: InChI=1S/C2H6O2/c3-1-2-4/h3-4H,1-2H2
CH$LINK: INCHIKEY LYCAIKOWRPUZTN-UHFFFAOYSA-N
CH$LINK: COMPTOX DTXSID8020597

AC$INSTRUMENT: HITACHI RMU-6M
AC$INSTRUMENT_TYPE: EI-B
AC$MASS_SPECTROMETRY: MS_TYPE MS
AC$MASS_SPECTROMETRY: ION_MODE POSITIVE
AC$MASS_SPECTROMETRY: IONIZATION_ENERGY 20 eV

MS$FOCUSED_ION: ION_TYPE [M]+*

PK$SPLASH: splash10-001i-9000000000-dcef056f352184a24448
PK$NUM_PEAK: 13
PK$PEAK: m/z int. rel.int.
  27 3.3 33
  28 1.8 18
  29 4.2 42
  30 0.11 1
  31 99.99 999
  32 12.1 121
  33 41.5 415
  42 0.12 1
  43 7.4 74
  44 2.8 28
  45 1.9 19
  61 0.21 2
  62 6.1 61