ACCESSION: MSBNK-Fac_Eng_Univ_Tokyo-JP009314
RECORD_TITLE: 1,2-DIMETHOXYETHANE; EI-B; MS
DATE: 2016.01.19 (Created 2008.10.21, modified 2011.05.06)
AUTHORS: YAMAMOTO M, DEP. CHEMISTRY, FAC. SCIENCE, NARA WOMEN'S UNIV.
LICENSE: CC BY-NC-SA

CH$NAME: 1,2-DIMETHOXYETHANE
CH$COMPOUND_CLASS: N/A
CH$FORMULA: C4H10O2
CH$EXACT_MASS: 90.06808
CH$SMILES: COCCOC
CH$IUPAC: InChI=1S/C4H10O2/c1-5-3-4-6-2/h3-4H2,1-2H3
CH$LINK: INCHIKEY XTHFKEDIFFGKHM-UHFFFAOYSA-N
CH$LINK: COMPTOX DTXSID0025286

AC$INSTRUMENT: HITACHI RMU-6M
AC$INSTRUMENT_TYPE: EI-B
AC$MASS_SPECTROMETRY: MS_TYPE MS
AC$MASS_SPECTROMETRY: ION_MODE POSITIVE
AC$MASS_SPECTROMETRY: IONIZATION_ENERGY 20 eV

MS$FOCUSED_ION: ION_TYPE [M]+*

PK$SPLASH: splash10-0002-9000000000-036857e2ba9f5826263b
PK$NUM_PEAK: 11
PK$PEAK: m/z int. rel.int.
  15 3.2 32
  28 1.9 19
  29 5.5 55
  31 0.35 4
  43 2.1 21
  45 99.99 999
  46 2.1 21
  58 0.75 8
  59 2.9 29
  60 14.1 141
  90 10.7 107