ACCESSION: MSBNK-Fac_Eng_Univ_Tokyo-JP009389
RECORD_TITLE: ETHYL CHLOROFORMATE; EI-B; MS
DATE: 2016.01.19 (Created 2008.10.21, modified 2011.05.06)
AUTHORS: GUNMA COLLEGE OF TECHNOLOGY
LICENSE: CC BY-NC-SA

CH$NAME: ETHYL CHLOROFORMATE
CH$COMPOUND_CLASS: N/A
CH$FORMULA: C3H5ClO2
CH$EXACT_MASS: 107.99781
CH$SMILES: CCOC(=O)Cl
CH$IUPAC: InChI=1S/C3H5ClO2/c1-2-6-3(4)5/h2H2,1H3
CH$LINK: INCHIKEY RIFGWPKJUGCATF-UHFFFAOYSA-N
CH$LINK: COMPTOX DTXSID1027186

AC$INSTRUMENT: HITACHI M-80A
AC$INSTRUMENT_TYPE: EI-B
AC$MASS_SPECTROMETRY: MS_TYPE MS
AC$MASS_SPECTROMETRY: ION_MODE POSITIVE
AC$MASS_SPECTROMETRY: IONIZATION_ENERGY 70 eV

MS$FOCUSED_ION: ION_TYPE [M]+*

PK$SPLASH: splash10-004i-9000000000-9799a824c9ed6db1e8ae
PK$NUM_PEAK: 18
PK$PEAK: m/z int. rel.int.
  15 6.19 62
  18 2.18 22
  25 1.24 12
  26 9.85 99
  27 35.57 356
  29 99.99 999
  30 2.88 29
  35 4.8 48
  36 1.7 17
  37 1.54 15
  42 1.05 11
  43 3.12 31
  44 8.03 80
  45 7.2 72
  63 21.33 213
  64 2.5 25
  65 6.93 69
  93 2.66 27