ACCESSION: MSBNK-Fac_Eng_Univ_Tokyo-JP009478
RECORD_TITLE: N,N-DIETHYLFORMAMIDE; EI-B; MS
DATE: 2016.01.19 (Created 2008.10.21, modified 2011.05.06)
AUTHORS: NARA WOMEN'S UNIVERSITY
LICENSE: CC BY-NC-SA

CH$NAME: N,N-DIETHYLFORMAMIDE
CH$COMPOUND_CLASS: N/A
CH$FORMULA: C5H11NO
CH$EXACT_MASS: 101.08406
CH$SMILES: CCN(CC)C=O
CH$IUPAC: InChI=1S/C5H11NO/c1-3-6(4-2)5-7/h5H,3-4H2,1-2H3
CH$LINK: CAS 617-84-5
CH$LINK: INCHIKEY SUAKHGWARZSWIH-UHFFFAOYSA-N
CH$LINK: COMPTOX DTXSID3020463

AC$INSTRUMENT: HITACHI M-80
AC$INSTRUMENT_TYPE: EI-B
AC$MASS_SPECTROMETRY: MS_TYPE MS
AC$MASS_SPECTROMETRY: ION_MODE POSITIVE
AC$MASS_SPECTROMETRY: IONIZATION_ENERGY 70 eV

MS$FOCUSED_ION: ION_TYPE [M]+*

PK$SPLASH: splash10-0zir-9200000000-b3af7374f9d7ee8e5000
PK$NUM_PEAK: 34
PK$PEAK: m/z int. rel.int.
  14 1.02 10
  15 9.38 94
  17 1.46 15
  18 12.63 126
  26 5.44 54
  27 29.68 297
  28 30.43 304
  29 35.77 358
  30 85.2 852
  31 1.44 14
  39 1.25 13
  40 2.78 28
  41 6.51 65
  42 17.46 175
  43 3.44 34
  44 45.32 453
  45 2.26 23
  46 2.3 23
  52 1.09 11
  54 1.64 16
  56 7.09 71
  57 1.35 14
  58 99.99 999
  59 3.76 38
  70 1.83 18
  72 18.18 182
  73 4.66 47
  79 1.06 11
  86 38.75 388
  87 1.83 18
  100 1.9 19
  101 91.45 915
  102 19.88 199
  103 1.2 12