ACCESSION: MSBNK-Fac_Eng_Univ_Tokyo-JP009488
RECORD_TITLE: N,N-DIMETHYLACETAMIDE; EI-B; MS
DATE: 2016.01.19 (Created 2008.10.21, modified 2011.05.06)
AUTHORS: NARA WOMEN'S UNIVERSITY
LICENSE: CC BY-NC-SA

CH$NAME: N,N-DIMETHYLACETAMIDE
CH$COMPOUND_CLASS: N/A
CH$FORMULA: C4H9NO
CH$EXACT_MASS: 87.06841
CH$SMILES: CN(C)C(C)=O
CH$IUPAC: InChI=1S/C4H9NO/c1-4(6)5(2)3/h1-3H3
CH$LINK: CAS 127-19-5
CH$LINK: INCHIKEY FXHOOIRPVKKKFG-UHFFFAOYSA-N
CH$LINK: COMPTOX DTXSID5020499

AC$INSTRUMENT: HITACHI M-80
AC$INSTRUMENT_TYPE: EI-B
AC$MASS_SPECTROMETRY: MS_TYPE MS
AC$MASS_SPECTROMETRY: ION_MODE POSITIVE
AC$MASS_SPECTROMETRY: IONIZATION_ENERGY 70 eV

MS$FOCUSED_ION: ION_TYPE [M]+*

PK$SPLASH: splash10-0006-9000000000-5e3281b4f8650eae12d9
PK$NUM_PEAK: 20
PK$PEAK: m/z int. rel.int.
  14 2.91 29
  15 20.98 210
  18 3.9 39
  27 2.05 21
  28 8.06 81
  29 1.63 16
  30 9.84 98
  31 1.77 18
  40 2.46 25
  41 4.13 41
  42 29.44 294
  43 46.3 463
  44 99.99 999
  45 22.05 221
  46 1.08 11
  56 2.02 20
  58 1.7 17
  72 19.44 194
  87 70.49 705
  88 16.04 160