ACCESSION: MSBNK-Fac_Eng_Univ_Tokyo-JP009599
RECORD_TITLE: ETHYL PHENYLACETATE; EI-B; MS
DATE: 2016.01.19 (Created 2008.10.21, modified 2011.05.06)
AUTHORS: THE INSTITUTE OF SCIENTIFIC AND INDUSTRIALRESEARCH
LICENSE: CC BY-NC-SA

CH$NAME: ETHYL PHENYLACETATE
CH$COMPOUND_CLASS: N/A
CH$FORMULA: C10H12O2
CH$EXACT_MASS: 164.08373
CH$SMILES: CCOC(=O)Cc(c1)cccc1
CH$IUPAC: InChI=1S/C10H12O2/c1-2-12-10(11)8-9-6-4-3-5-7-9/h3-7H,2,8H2,1H3
CH$LINK: INCHIKEY DULCUDSUACXJJC-UHFFFAOYSA-N
CH$LINK: COMPTOX DTXSID6044353

AC$INSTRUMENT: JEOL JMS-DX-300
AC$INSTRUMENT_TYPE: EI-B
AC$MASS_SPECTROMETRY: MS_TYPE MS
AC$MASS_SPECTROMETRY: ION_MODE POSITIVE
AC$MASS_SPECTROMETRY: IONIZATION_ENERGY 70 eV

MS$FOCUSED_ION: ION_TYPE [M]+*

PK$SPLASH: splash10-0006-9100000000-95ebd9a41c4a5c677094
PK$NUM_PEAK: 19
PK$PEAK: m/z int. rel.int.
  27 6.6 66
  29 19 190
  30 1 10
  39 0.6 6
  41 1.4 14
  43 1 10
  51 2.7 27
  63 0.4 4
  64 1.3 13
  65 15.9 159
  77 1.2 12
  89 0.52 5
  90 3.7 37
  91 99.99 999
  92 11.8 118
  105 0.22 2
  119 2.1 21
  164 16.4 164
  165 1.8 18