ACCESSION: MSBNK-Fac_Eng_Univ_Tokyo-JP009654
RECORD_TITLE: ETHYL 3-DIMETHYLAMINOBENZOATE; EI-B; MS
DATE: 2016.01.19 (Created 2008.10.21, modified 2011.05.06)
AUTHORS: THE INSTITUTE OF SCIENTIFIC AND INDUSTRIALRESEARCH
LICENSE: CC BY-NC-SA

CH$NAME: ETHYL 3-DIMETHYLAMINOBENZOATE
CH$COMPOUND_CLASS: N/A
CH$FORMULA: C11H15NO2
CH$EXACT_MASS: 193.11028
CH$SMILES: CCOC(=O)c(c1)cc(cc1)N(C)C
CH$IUPAC: InChI=1S/C11H15NO2/c1-4-14-11(13)9-6-5-7-10(8-9)12(2)3/h5-8H,4H2,1-3H3
CH$LINK: INCHIKEY CQNOGTUXPYIVDM-UHFFFAOYSA-N
CH$LINK: COMPTOX DTXSID40876509

AC$INSTRUMENT: JEOL JMS-DX-300
AC$INSTRUMENT_TYPE: EI-B
AC$MASS_SPECTROMETRY: MS_TYPE MS
AC$MASS_SPECTROMETRY: ION_MODE POSITIVE
AC$MASS_SPECTROMETRY: IONIZATION_ENERGY 70 eV

MS$FOCUSED_ION: ION_TYPE [M]+*

PK$SPLASH: splash10-0006-0900000000-f3e20ca2ef495b03f6e1
PK$NUM_PEAK: 25
PK$PEAK: m/z int. rel.int.
  28 3.2 32
  42 2.1 21
  77 4.6 46
  78 0.11 1
  79 1.6 16
  91 1.3 13
  104 1.7 17
  105 1.18 12
  106 1.8 18
  118 1.8 18
  119 1.7 17
  120 1.17 12
  121 11.1 111
  122 4.4 44
  139 1.5 15
  148 1.14 11
  149 3 30
  150 5.3 53
  164 43.9 439
  165 2.96 30
  166 3 30
  192 22.2 222
  193 99.99 999
  194 1.28 13
  195 1 10