ACCESSION: MSBNK-Fac_Eng_Univ_Tokyo-JP009662
RECORD_TITLE: ETHYL 2-FLUORENYLCARBOXYLATE; EI-B; MS
DATE: 2016.01.19 (Created 2008.10.21, modified 2011.05.06)
AUTHORS: THE INSTITUTE OF SCIENTIFIC AND INDUSTRIALRESEARCH
LICENSE: CC BY-NC-SA

CH$NAME: ETHYL 2-FLUORENYLCARBOXYLATE
CH$COMPOUND_CLASS: N/A
CH$FORMULA: C16H14O2
CH$EXACT_MASS: 238.09938
CH$SMILES: CCOC(=O)c(c3)cc(C1)c(c3)c(c2)c(ccc2)1
CH$IUPAC: InChI=1S/C16H14O2/c1-2-18-16(17)12-7-8-15-13(10-12)9-11-5-3-4-6-14(11)15/h3-8,10H,2,9H2,1H3
CH$LINK: INCHIKEY SAFAPOUNUGQSNS-UHFFFAOYSA-N
CH$LINK: COMPTOX DTXSID50483662

AC$INSTRUMENT: JEOL JMS-DX-300
AC$INSTRUMENT_TYPE: EI-B
AC$MASS_SPECTROMETRY: MS_TYPE MS
AC$MASS_SPECTROMETRY: ION_MODE POSITIVE
AC$MASS_SPECTROMETRY: IONIZATION_ENERGY 70 eV

MS$FOCUSED_ION: ION_TYPE [M]+*

PK$SPLASH: splash10-014r-1930000000-043152fe74f184dc9fb7
PK$NUM_PEAK: 32
PK$PEAK: m/z int. rel.int.
  27 1.6 16
  29 8.7 87
  40 1.2 12
  44 0.6 6
  63 1.6 16
  70 2.8 28
  81 1.2 12
  82 0.44 4
  83 7.3 73
  89 1 10
  91 3.8 38
  96 0.37 4
  97 5.8 58
  115 2.8 28
  139 3.5 35
  152 0.13 1
  162 1.4 14
  163 11.6 116
  164 12.9 129
  165 99.99 999
  166 23.3 233
  167 2.5 25
  179 1.9 19
  192 0.22 2
  193 30.3 303
  194 5.4 54
  209 7.6 76
  210 0.81 8
  211 1 10
  238 62.8 628
  239 11.4 114
  240 1.1 11