ACCESSION: MSBNK-Fac_Eng_Univ_Tokyo-JP009809
RECORD_TITLE: N,N-DIETHYL-2,7-OCTADIENYLAMINE; EI-B; MS
DATE: 2016.01.19 (Created 2008.10.21, modified 2011.05.06)
AUTHORS: KURARAY CO., LTD.
LICENSE: CC BY-NC-SA

CH$NAME: N,N-DIETHYL-2,7-OCTADIENYLAMINE
CH$COMPOUND_CLASS: N/A
CH$FORMULA: C12H23N
CH$EXACT_MASS: 181.18305
CH$SMILES: C=CCCCC=CCN(CC)CC
CH$IUPAC: InChI=1S/C12H23N/c1-4-7-8-9-10-11-12-13(5-2)6-3/h4,10-11H,1,5-9,12H2,2-3H3/b11-10+
CH$LINK: INCHIKEY ZDIDSJWITLGYFN-ZHACJKMWSA-N

AC$INSTRUMENT: JEOL JMS-D-300
AC$INSTRUMENT_TYPE: EI-B
AC$MASS_SPECTROMETRY: MS_TYPE MS
AC$MASS_SPECTROMETRY: ION_MODE POSITIVE
AC$MASS_SPECTROMETRY: IONIZATION_ENERGY 70 eV

MS$FOCUSED_ION: ION_TYPE [M]+*

PK$SPLASH: splash10-066r-9200000000-c80f069f3875a73e0def
PK$NUM_PEAK: 61
PK$PEAK: m/z int. rel.int.
  26 4.2 42
  27 10.6 106
  28 3.9 39
  29 1.56 16
  30 11.3 113
  39 10.8 108
  40 3 30
  41 2.41 24
  42 15.3 153
  43 46.6 466
  44 3.9 39
  53 0.78 8
  54 14.1 141
  55 31.3 313
  56 17.6 176
  57 0.66 7
  58 99.99 999
  59 5.9 59
  65 3.4 34
  66 0.31 3
  67 90.5 905
  68 8.8 88
  69 2.8 28
  70 0.47 5
  71 7.7 77
  72 17.2 172
  73 31.4 314
  74 0.3 3
  77 3 30
  79 7.5 75
  80 6.3 63
  81 1.13 11
  82 4.7 47
  83 1.6 16
  84 5.6 56
  85 0.19 2
  86 50.9 509
  87 3.4 34
  91 1.9 19
  93 0.36 4
  94 1.9 19
  96 3.8 38
  97 1.7 17
  98 0.55 6
  99 7.8 78
  100 1.6 16
  107 1.9 19
  108 0.36 4
  109 20.8 208
  110 6.9 69
  111 1.7 17
  112 0.98 10
  124 2.3 23
  126 5.5 55
  138 9.4 94
  152 0.16 2
  166 92 920
  167 11.6 116
  180 8.4 84
  181 1.66 17
  182 3 30