ACCESSION: MSBNK-Fac_Eng_Univ_Tokyo-JP010616
RECORD_TITLE: ETHYL LACTATE; EI-B; MS
DATE: 2016.01.19 (Created 2008.10.21, modified 2011.05.06)
AUTHORS: YAMAMOTO M, DEP. CHEMISTRY, FAC. SCIENCE, NARA WOMEN'S UNIV.
LICENSE: CC BY-NC-SA

CH$NAME: ETHYL LACTATE
CH$COMPOUND_CLASS: N/A
CH$FORMULA: C5H10O3
CH$EXACT_MASS: 118.06299
CH$SMILES: CCOC(=O)C(C)O
CH$IUPAC: InChI=1S/C5H10O3/c1-3-8-5(7)4(2)6/h4,6H,3H2,1-2H3
CH$LINK: INCHIKEY LZCLXQDLBQLTDK-UHFFFAOYSA-N
CH$LINK: COMPTOX DTXSID6029127

AC$INSTRUMENT: HITACHI RMU-6M
AC$INSTRUMENT_TYPE: EI-B
AC$MASS_SPECTROMETRY: MS_TYPE MS
AC$MASS_SPECTROMETRY: ION_MODE POSITIVE
AC$MASS_SPECTROMETRY: IONIZATION_ENERGY 20 eV

MS$FOCUSED_ION: ION_TYPE [M]+*

PK$SPLASH: splash10-0002-9000000000-ed88c07bf74cec56cc26
PK$NUM_PEAK: 11
PK$PEAK: m/z int. rel.int.
  27 2.2 22
  28 1.1 11
  29 9 90
  31 0.11 1
  43 1.8 18
  45 99.99 999
  46 2.9 29
  47 0.11 1
  56 1.1 11
  75 5.1 51
  103 0.7 7