ACCESSION: MSBNK-Fac_Eng_Univ_Tokyo-JP010687
RECORD_TITLE: ALPHA-COPAENE; EI-B; MS
DATE: 2016.01.19 (Created 2008.10.21, modified 2011.05.06)
AUTHORS: EGUCHI S, FAC. OF SCIENCE, HIROSHIMA UNIV.
LICENSE: CC BY-NC-SA

CH$NAME: ALPHA-COPAENE
CH$COMPOUND_CLASS: N/A
CH$FORMULA: C15H24
CH$EXACT_MASS: 204.1878
CH$SMILES: N/A
CH$IUPAC: N/A

AC$INSTRUMENT: HITACHI RMU-6L
AC$INSTRUMENT_TYPE: EI-B
AC$MASS_SPECTROMETRY: MS_TYPE MS
AC$MASS_SPECTROMETRY: ION_MODE POSITIVE
AC$MASS_SPECTROMETRY: IONIZATION_ENERGY 70 eV

MS$FOCUSED_ION: ION_TYPE [M]+*

PK$SPLASH: splash10-03xu-5900000000-8f7f376dc0524c9bf643
PK$NUM_PEAK: 69
PK$PEAK: m/z int. rel.int.
  41 25 250
  42 2 20
  43 11 110
  44 0.2 2
  51 3 30
  53 7 70
  55 18 180
  56 0.4 4
  57 3 30
  65 5.4 54
  66 1 10
  67 0.8 8
  68 1 10
  69 10 100
  70 2 20
  71 0.1 1
  77 11 110
  78 3 30
  79 10 100
  80 0.4 4
  81 19 190
  82 2 20
  83 4 40
  85 0.1 1
  91 20 200
  92 18 180
  93 33 330
  94 0.9 9
  95 5 50
  103 2 20
  104 1 10
  105 6.8 68
  106 11 110
  107 13 130
  108 5 50
  109 0.3 3
  115 3 30
  116 1 10
  117 4 40
  118 0.3 3
  119 81 810
  120 20 200
  121 11 110
  122 0.5 5
  123 2 20
  128 1 10
  129 2 20
  130 0.1 1
  131 4 40
  132 1 10
  133 10 100
  134 0.6 6
  135 4 40
  136 11 110
  137 2 20
  145 0.3 3
  146 1 10
  147 6 60
  148 4 40
  149 0.1 1
  161 99.99 999
  162 13 130
  163 1 10
  175 0.2 2
  176 1 10
  189 6 60
  190 1 10
  204 3.4 34
  205 5 50