ACCESSION: MSBNK-Fac_Eng_Univ_Tokyo-JP010969
RECORD_TITLE: TRANS-2,3,4A,9A-TETRAHYDRO-4A,9A-DIMETHOXY-3'-BUTOXYSPIRO(CYCLOHEPTA(1,4)DIOXINE-7,2'-OXETANE); EI-B; MS
DATE: 2016.01.19 (Created 2008.10.21, modified 2011.05.06)
AUTHORS: TAKESHITA H, INST. OF ADVANCED MATERIAL STUDY KYUSHU UNIV.
LICENSE: CC BY-NC-SA

CH$NAME: TRANS-2,3,4A,9A-TETRAHYDRO-4A,9A-DIMETHOXY-3'-BUTOXYSPIRO(CYCLOHEPTA(1,4)DIOXINE-7,2'-OXETANE)
CH$COMPOUND_CLASS: N/A
CH$FORMULA: C17H26O6
CH$EXACT_MASS: 326.17294
CH$SMILES: N/A
CH$IUPAC: N/A

AC$INSTRUMENT: JEOL JMS-01-SG-2
AC$INSTRUMENT_TYPE: EI-B
AC$MASS_SPECTROMETRY: MS_TYPE MS
AC$MASS_SPECTROMETRY: ION_MODE POSITIVE
AC$MASS_SPECTROMETRY: IONIZATION_ENERGY 75 eV

MS$FOCUSED_ION: ION_TYPE [M]+*

PK$SPLASH: splash10-0pbc-9630000000-38daf5c0502572a86886
PK$NUM_PEAK: 63
PK$PEAK: m/z int. rel.int.
  40 17.94 179
  42 56.59 566
  44 14.69 147
  46 19.61 196
  53 15.33 153
  55 35.91 359
  56 65.6 656
  57 51.8 518
  59 25.99 260
  69 13.32 133
  71 16.04 160
  77 11.93 119
  81 11.72 117
  85 41.66 417
  95 13.11 131
  97 24.2 242
  100 27.17 272
  103 99.99 999
  111 13.13 131
  113 25.91 259
  123 18.41 184
  127 17.74 177
  137 12.56 126
  143 38.85 389
  144 11.93 119
  153 14.26 143
  195 11.3 113
  199 12.3 123
  200 41.46 415
  201 4.86 49
  206 6.04 60
  207 9.22 92
  208 2.62 26
  209 3.5 35
  210 1.21 12
  211 3.71 37
  212 1.53 15
  213 1.08 11
  214 1.59 16
  221 3.69 37
  222 2.91 29
  223 2.03 20
  226 3.51 35
  227 2.16 22
  237 1.54 15
  238 2.38 24
  239 2.72 27
  240 1.11 11
  250 2.75 28
  252 1.92 19
  253 6.23 62
  254 2.3 23
  263 17.63 176
  264 3.21 32
  265 2.51 25
  280 7.5 75
  281 3.17 32
  294 5.61 56
  295 8.38 84
  296 2.06 21
  312 2.4 24
  326 5.3 53
  327 1.04 10