ACCESSION: MSBNK-Fac_Eng_Univ_Tokyo-JP010970
RECORD_TITLE: TRANS-2,3,4A,9A-TETRAHYDRO-4A,9A-DIMETHOXY-3'-ISOBUTOXYSPIRO(CYCLOHEPTA(1,4)DIOXINE-7,2'-OXETANE; EI-B; MS
DATE: 2016.01.19 (Created 2008.10.21, modified 2011.05.06)
AUTHORS: TAKESHITA H, INST. OF ADVANCED MATERIAL STUDY KYUSHU UNIV.
LICENSE: CC BY-NC-SA

CH$NAME: TRANS-2,3,4A,9A-TETRAHYDRO-4A,9A-DIMETHOXY-3'-ISOBUTOXYSPIRO(CYCLOHEPTA(1,4)DIOXINE-7,2'-OXETANE
CH$COMPOUND_CLASS: N/A
CH$FORMULA: C17H26O6
CH$EXACT_MASS: 326.17294
CH$SMILES: N/A
CH$IUPAC: N/A

AC$INSTRUMENT: JEOL JMS-01-SG-2
AC$INSTRUMENT_TYPE: EI-B
AC$MASS_SPECTROMETRY: MS_TYPE MS
AC$MASS_SPECTROMETRY: ION_MODE POSITIVE
AC$MASS_SPECTROMETRY: IONIZATION_ENERGY 75 eV

MS$FOCUSED_ION: ION_TYPE [M]+*

PK$SPLASH: splash10-0pb9-9740000000-1dfbca8424c9d2d32ee2
PK$NUM_PEAK: 61
PK$PEAK: m/z int. rel.int.
  38 12.44 124
  40 40.14 401
  42 16.09 161
  44 14.74 147
  53 8.86 89
  55 16.16 162
  56 51.49 515
  57 92.67 927
  59 24.71 247
  73 8.19 82
  75 14.58 146
  77 7.43 74
  85 9.77 98
  97 9.76 98
  100 19.26 193
  103 99.99 999
  111 7.93 79
  113 23.61 236
  116 8.75 88
  123 11.62 116
  137 10.18 102
  143 13.78 138
  144 7.13 71
  153 8.24 82
  165 7.38 74
  167 8.14 81
  179 7.78 78
  180 8.86 89
  194 11.97 120
  195 13.53 135
  200 28.66 287
  207 11.27 113
  208 2.13 21
  209 5.55 56
  211 4.37 44
  212 1.79 18
  213 2.47 25
  221 4.7 47
  222 3.18 32
  223 2.01 20
  226 4.73 47
  227 4.43 44
  238 3.96 40
  239 3.49 35
  240 1.76 18
  250 2.32 23
  252 2.72 27
  253 5.81 58
  254 3.18 32
  263 20.04 200
  264 3.47 35
  265 2.74 27
  273 2.05 21
  280 2.92 29
  281 2.09 21
  294 9.17 92
  295 13.83 138
  296 4.04 40
  312 2.32 23
  326 10.81 108
  327 2.21 22