ACCESSION: MSBNK-Fac_Eng_Univ_Tokyo-JP011057
RECORD_TITLE: 2-AMINOTHIAZOLE; EI-B; MS
DATE: 2016.01.19 (Created 2008.10.21, modified 2011.05.06)
AUTHORS: YAMAMOTO M, DEP. CHEMISTRY, FAC. SCIENCE, NARA WOMEN'S UNIV.
LICENSE: CC BY-NC-SA

CH$NAME: 2-AMINOTHIAZOLE
CH$COMPOUND_CLASS: N/A
CH$FORMULA: C3H4N2S
CH$EXACT_MASS: 100.00952
CH$SMILES: Nc(n1)scc1
CH$IUPAC: InChI=1S/C3H4N2S/c4-3-5-1-2-6-3/h1-2H,(H2,4,5)
CH$LINK: CAS 96-50-4
CH$LINK: INCHIKEY RAIPHJJURHTUIC-UHFFFAOYSA-N
CH$LINK: COMPTOX DTXSID5024508

AC$INSTRUMENT: HITACHI M-80
AC$INSTRUMENT_TYPE: EI-B
AC$MASS_SPECTROMETRY: MS_TYPE MS
AC$MASS_SPECTROMETRY: ION_MODE POSITIVE
AC$MASS_SPECTROMETRY: IONIZATION_ENERGY 70 eV

MS$FOCUSED_ION: ION_TYPE [M]+*

PK$SPLASH: splash10-0zfr-9400000000-e3242ff5e4e20606e66d
PK$NUM_PEAK: 30
PK$PEAK: m/z int. rel.int.
  18 2.17 22
  26 3.16 32
  27 4.37 44
  28 27.07 271
  29 1.56 16
  32 4.06 41
  38 1.69 17
  39 2.48 25
  40 4.63 46
  41 3.21 32
  42 6.07 61
  43 7.82 78
  44 3.38 34
  45 19.5 195
  46 6.82 68
  47 2.33 23
  53 1.95 20
  55 5.93 59
  57 13.63 136
  58 74.13 741
  59 4.75 48
  60 10.5 105
  70 2.05 21
  71 1.29 13
  72 1.2 12
  73 17.31 173
  74 1.77 18
  100 99.99 999
  101 6.7 67
  102 4.83 48