ACCESSION: MSBNK-Fac_Eng_Univ_Tokyo-JP011195
RECORD_TITLE: N-(1-NAPHTHYLMETHYLIDENE)METHYLAMINE; EI-B; MS
DATE: 2016.01.19 (Created 2008.10.21, modified 2011.05.06)
AUTHORS: SAWADA M, THE INST. OF SCIENTIFIC AND INDUSTRIALRESEARCH OSAKA UNIV.
LICENSE: CC BY-NC-SA

CH$NAME: N-(1-NAPHTHYLMETHYLIDENE)METHYLAMINE
CH$COMPOUND_CLASS: N/A
CH$FORMULA: C12H11N
CH$EXACT_MASS: 169.08915
CH$SMILES: CN=Cc(c1)c(c2)c(ccc2)cc1
CH$IUPAC: InChI=1S/C12H11N/c1-13-9-11-7-4-6-10-5-2-3-8-12(10)11/h2-9H,1H3/b13-9+
CH$LINK: INCHIKEY JPFXXCHVHVZOIN-UKTHLTGXSA-N

AC$INSTRUMENT: JEOL JMS-DX-300
AC$INSTRUMENT_TYPE: EI-B
AC$MASS_SPECTROMETRY: MS_TYPE MS
AC$MASS_SPECTROMETRY: ION_MODE POSITIVE
AC$MASS_SPECTROMETRY: IONIZATION_ENERGY 70 eV

MS$FOCUSED_ION: ION_TYPE [M]+*

PK$SPLASH: splash10-004i-9500000000-4bb24581bfb8b8b57aa4
PK$NUM_PEAK: 71
PK$PEAK: m/z int. rel.int.
  37 8.4 84
  38 30.4 304
  39 54.5 545
  40 18.4 184
  41 53.7 537
  42 85.4 854
  43 8.7 87
  44 1 10
  49 3.2 32
  50 62 620
  51 63.5 635
  52 24 240
  53 4.6 46
  61 14.6 146
  62 48.8 488
  63 70.8 708
  64 14.9 149
  65 11.4 114
  66 2 20
  73 4.4 44
  74 61.6 616
  75 62 620
  76 39.1 391
  77 54 540
  78 10.9 109
  83 2.2 22
  85 5.3 53
  86 22.4 224
  87 39.8 398
  88 11.3 113
  89 18.6 186
  90 2.7 27
  91 2.2 22
  97 1.6 16
  98 16.9 169
  99 15.1 151
  100 14.3 143
  101 32.4 324
  102 27.9 279
  103 3.3 33
  110 2.8 28
  111 5.6 56
  112 1.8 18
  113 11.8 118
  114 4.8 48
  115 3.7 37
  116 4.4 44
  122 1.8 18
  125 7 70
  126 79.6 796
  127 99.99 999
  128 39.7 397
  129 3.7 37
  137 1.9 19
  138 2.3 23
  139 25.5 255
  140 6.4 64
  141 8 80
  142 1.6 16
  151 1.3 13
  152 4.2 42
  153 19.3 193
  154 19.4 194
  155 3.2 32
  156 2.3 23
  166 5.4 54
  167 11 110
  168 46.6 466
  169 50.5 505
  170 11.2 112
  171 1 10