ACCESSION: MSBNK-Fac_Eng_Univ_Tokyo-JP011349
RECORD_TITLE: 1,1,2,2-TETRAMETHYLDISILANE; EI-B; MS
DATE: 2016.01.19 (Created 2008.10.21, modified 2011.05.06)
AUTHORS: YAMAMOTO M, DEP. CHEMISTRY, FAC. SCIENCE, NARA WOMEN'S UNIV.
LICENSE: CC BY-NC-SA

CH$NAME: 1,1,2,2-TETRAMETHYLDISILANE
CH$COMPOUND_CLASS: N/A
CH$FORMULA: C4H14Si2
CH$EXACT_MASS: 118.06340
CH$SMILES: C[SiH](C)[SiH](C)C
CH$IUPAC: InChI=1S/C4H14Si2/c1-5(2)6(3)4/h5-6H,1-4H3
CH$LINK: INCHIKEY RDWAGGBALVFUHB-UHFFFAOYSA-N
CH$LINK: COMPTOX DTXSID40883591

AC$INSTRUMENT: HITACHI RMU-6M
AC$INSTRUMENT_TYPE: EI-B
AC$MASS_SPECTROMETRY: MS_TYPE MS
AC$MASS_SPECTROMETRY: ION_MODE POSITIVE
AC$MASS_SPECTROMETRY: IONIZATION_ENERGY 70 eV

MS$FOCUSED_ION: ION_TYPE [M]+*

PK$SPLASH: splash10-0ab9-9200000000-aeea5de1da9f8e7293b3
PK$NUM_PEAK: 46
PK$PEAK: m/z int. rel.int.
  28 3.4 34
  29 5.1 51
  31 11.7 117
  32 1.1 11
  39 2.1 21
  42 3.5 35
  43 41.4 414
  44 6.2 62
  45 9.6 96
  50 2.1 21
  51 2.8 28
  52 3.1 31
  53 2.3 23
  55 2.5 25
  57 3 30
  58 61.5 615
  59 99.99 999
  60 9.1 91
  61 3.4 34
  69 5.3 53
  70 1.8 18
  71 2.4 24
  72 1.5 15
  73 84.7 847
  74 7.6 76
  75 3.4 34
  76 1 10
  77 2.7 27
  81 1.5 15
  83 1.3 13
  84 1 10
  85 4 40
  86 1.5 15
  87 3 30
  99 1.6 16
  100 1.1 11
  101 7.3 73
  102 14.6 146
  103 29.5 295
  104 4.6 46
  105 2 20
  116 1.3 13
  117 8.4 84
  118 32.2 322
  119 5.2 52
  120 2.6 26