ACCESSION: MSBNK-Fac_Eng_Univ_Tokyo-JP011350
RECORD_TITLE: 1,1,2,2-TETRAMETHYLDISILANE (D2); EI-B; MS
DATE: 2016.01.19 (Created 2008.10.21, modified 2011.05.06)
AUTHORS: YAMAMOTO M, DEP. CHEMISTRY, FAC. SCIENCE, NARA WOMEN'S UNIV.
LICENSE: CC BY-NC-SA

CH$NAME: 1,1,2,2-TETRAMETHYLDISILANE (D2)
CH$COMPOUND_CLASS: N/A
CH$FORMULA: C4H14Si2
CH$EXACT_MASS: 118.06340
CH$SMILES: [2H][Si](C)(C)[Si]([2H])(C)C
CH$IUPAC: InChI=1S/C4H14Si2/c1-5(2)6(3)4/h5-6H,1-4H3/i5D,6D
CH$LINK: INCHIKEY RDWAGGBALVFUHB-KCZCTXNHSA-N

AC$INSTRUMENT: HITACHI RMU-6M
AC$INSTRUMENT_TYPE: EI-B
AC$MASS_SPECTROMETRY: MS_TYPE MS
AC$MASS_SPECTROMETRY: ION_MODE POSITIVE
AC$MASS_SPECTROMETRY: IONIZATION_ENERGY 70 eV

MS$FOCUSED_ION: ION_TYPE [M]+*

PK$SPLASH: splash10-074i-9200000000-c7d8112d6a72d812a412
PK$NUM_PEAK: 55
PK$PEAK: m/z int. rel.int.
  28 3.3 33
  29 4.9 49
  30 1 10
  31 7.9 79
  32 5.2 52
  39 1.2 12
  42 3 30
  43 38.9 389
  44 10.4 104
  45 6.5 65
  46 3.3 33
  47 1.8 18
  50 1.6 16
  51 1.7 17
  52 1.8 18
  53 2 20
  55 1.8 18
  56 1.2 12
  57 1.8 18
  58 67.9 679
  59 12.1 121
  60 99.99 999
  61 8.5 85
  62 3.7 37
  69 4.2 42
  70 2.4 24
  71 2 20
  72 1.8 18
  73 78.6 786
  74 12.2 122
  75 4 40
  76 1.1 11
  77 1.8 18
  81 1.2 12
  83 1 10
  84 1.2 12
  85 1.8 18
  86 3.1 31
  87 1.8 18
  88 2 20
  89 1.6 16
  99 1 10
  101 4 40
  102 3.5 35
  103 10.2 102
  104 2.4 24
  105 31.2 312
  106 4.7 47
  107 2.6 26
  116 1 10
  118 4.7 47
  119 1.8 18
  120 34 340
  121 5.2 52
  122 2.9 29