ACCESSION: MSBNK-Fac_Eng_Univ_Tokyo-JP011362
RECORD_TITLE: SILACYCLOHEXANE (1,1-D2); EI-B; MS
DATE: 2016.01.19 (Created 2008.10.21, modified 2011.05.06)
AUTHORS: YAMAMOTO M, DEP. CHEMISTRY, FAC. SCIENCE, NARA WOMEN'S UNIV.
LICENSE: CC BY-NC-SA

CH$NAME: SILACYCLOHEXANE (1,1-D2)
CH$COMPOUND_CLASS: N/A
CH$FORMULA: C5H12Si
CH$EXACT_MASS: 100.07083
CH$SMILES: [2H][Si]([2H])(C1)CCCC1
CH$IUPAC: InChI=1S/C5H12Si/c1-2-4-6-5-3-1/h1-6H2/i6D2
CH$LINK: INCHIKEY VMNDCBPWBMKDBI-NCYHJHSESA-N

AC$INSTRUMENT: HITACHI RMU-6M
AC$INSTRUMENT_TYPE: EI-B
AC$MASS_SPECTROMETRY: MS_TYPE MS
AC$MASS_SPECTROMETRY: ION_MODE POSITIVE
AC$MASS_SPECTROMETRY: IONIZATION_ENERGY 70 eV

MS$FOCUSED_ION: ION_TYPE [M]+*

PK$SPLASH: splash10-00di-9100000000-451e106b2eebcfd502b3
PK$NUM_PEAK: 52
PK$PEAK: m/z int. rel.int.
  27 5.2 52
  28 6 60
  29 4.4 44
  30 2.5 25
  31 2.8 28
  32 4.5 45
  33 3.2 32
  38 0.6 6
  39 5.7 57
  40 1.6 16
  41 5.9 59
  42 2.8 28
  43 11.9 119
  44 22.5 225
  45 22.8 228
  46 18.3 183
  47 3.9 39
  48 0.7 7
  53 2.8 28
  54 1 10
  55 3.7 37
  56 3.9 39
  57 3.9 39
  58 5.9 59
  59 10.5 105
  60 6.3 63
  61 9 90
  62 1.1 11
  66 1.2 12
  67 1.8 18
  68 1.2 12
  69 1.9 19
  70 4.6 46
  71 8.5 85
  72 19.2 192
  73 41.8 418
  74 99.99 999
  75 10.4 104
  76 3.9 39
  83 2 20
  84 1.3 13
  86 1.9 19
  87 2.3 23
  96 0.6 6
  97 2.8 28
  98 6.8 68
  99 3.9 39
  100 7.7 77
  101 2.3 23
  102 58.9 589
  103 6.1 61
  104 2 20