ACCESSION: MSBNK-Fac_Eng_Univ_Tokyo-JP011363
RECORD_TITLE: 1,1-DIMETHLSILACYCLOHEXANE(METHYL-D6); EI-B; MS
DATE: 2016.01.19 (Created 2008.10.21, modified 2011.05.06)
AUTHORS: YAMAMOTO M, DEP. CHEMISTRY, FAC. SCIENCE, NARA WOMEN'S UNIV.
LICENSE: CC BY-NC-SA

CH$NAME: 1,1-DIMETHLSILACYCLOHEXANE(METHYL-D6)
CH$COMPOUND_CLASS: N/A
CH$FORMULA: C7H16Si
CH$EXACT_MASS: 128.10213
CH$SMILES: [2H]C([2H])([2H])[Si](C1)(CCCC1)C([2H])([2H])[2H]
CH$IUPAC: InChI=1S/C7H16Si/c1-8(2)6-4-3-5-7-8/h3-7H2,1-2H3/i1D3,2D3
CH$LINK: INCHIKEY VPVXTYYXTKCTPM-WFGJKAKNSA-N

AC$INSTRUMENT: HITACHI RMU-6M
AC$INSTRUMENT_TYPE: EI-B
AC$MASS_SPECTROMETRY: MS_TYPE MS
AC$MASS_SPECTROMETRY: ION_MODE POSITIVE
AC$MASS_SPECTROMETRY: IONIZATION_ENERGY 70 eV

MS$FOCUSED_ION: ION_TYPE [M]+*

PK$SPLASH: splash10-014r-9500000000-a9abc9a2e70ce96f6921
PK$NUM_PEAK: 70
PK$PEAK: m/z int. rel.int.
  27 2.8 28
  28 7.4 74
  29 2.4 24
  30 3.4 34
  31 1 10
  32 2.2 22
  33 3.7 37
  34 3.7 37
  39 2.4 24
  40 0.8 8
  41 2.3 23
  42 1 10
  43 3.4 34
  44 3.1 31
  45 3.3 33
  46 18.2 182
  47 3.4 34
  48 7.1 71
  49 2.5 25
  50 1.1 11
  53 1.4 14
  54 0.6 6
  55 2.4 24
  56 1.2 12
  57 1.2 12
  58 0.8 8
  59 1.5 15
  60 2.5 25
  61 2.9 29
  62 17.2 172
  63 2.9 29
  64 7.4 74
  65 25.4 254
  66 2.3 23
  67 2.3 23
  69 0.8 8
  71 0.8 8
  72 1.1 11
  73 1.1 11
  74 3.7 37
  75 1.4 14
  76 1.6 16
  77 1.2 12
  78 16.1 161
  79 2.6 26
  80 0.8 8
  82 4.9 49
  85 1.5 15
  86 3.1 31
  87 5.7 57
  88 70.4 704
  89 8.9 89
  90 3.7 37
  91 7.2 72
  92 3 30
  93 1 10
  97 1 10
  105 3.2 32
  106 6.4 64
  107 0.7 7
  110 0.6 6
  114 2 20
  115 2.4 24
  116 99.99 999
  117 13.2 132
  118 4.1 41
  133 1.6 16
  134 39.7 397
  135 5.7 57
  136 1.7 17