ACCESSION: MSBNK-Fac_Eng_Univ_Tokyo-JP011554
RECORD_TITLE: 1,1,2,2-TETRAMETHYLDISILANE; EI-B; MS
DATE: 2016.01.19 (Created 2008.10.21, modified 2011.05.06)
AUTHORS: YAMAMOTO M, DEP. CHEMISTRY, FAC. SCIENCE, NARA WOMEN'S UNIV.
LICENSE: CC BY-NC-SA

CH$NAME: 1,1,2,2-TETRAMETHYLDISILANE
CH$COMPOUND_CLASS: N/A
CH$FORMULA: C4H14Si2
CH$EXACT_MASS: 118.06340
CH$SMILES: C[SiH](C)[SiH](C)C
CH$IUPAC: InChI=1S/C4H14Si2/c1-5(2)6(3)4/h5-6H,1-4H3
CH$LINK: INCHIKEY RDWAGGBALVFUHB-UHFFFAOYSA-N
CH$LINK: COMPTOX DTXSID40883591

AC$INSTRUMENT: HITACHI RMU-6M
AC$INSTRUMENT_TYPE: EI-B
AC$MASS_SPECTROMETRY: MS_TYPE MS
AC$MASS_SPECTROMETRY: ION_MODE POSITIVE
AC$MASS_SPECTROMETRY: IONIZATION_ENERGY 20 eV

MS$FOCUSED_ION: ION_TYPE [M]+*

PK$SPLASH: splash10-0ab9-9300000000-135403fabbe2cded1597
PK$NUM_PEAK: 29
PK$PEAK: m/z int. rel.int.
  28 1.2 12
  31 2 20
  43 16.7 167
  44 2.6 26
  45 2.6 26
  52 2.1 21
  57 1 10
  58 71.8 718
  59 99.99 999
  60 8.3 83
  61 3.8 38
  72 1.7 17
  73 98.9 989
  74 8.3 83
  75 3.6 36
  77 1.8 18
  87 2 20
  99 1.2 12
  100 1.2 12
  101 6.3 63
  102 16.9 169
  103 31.1 311
  104 4.8 48
  105 2.2 22
  116 1.4 14
  117 10 100
  118 46.1 461
  119 7.8 78
  120 3.8 38