ACCESSION: MSBNK-Fac_Eng_Univ_Tokyo-JP011555
RECORD_TITLE: 1,1,2,2-TETRAMETHYLDISILANE (1,2-D2); EI-B; MS
DATE: 2016.01.19 (Created 2008.10.21, modified 2011.05.06)
AUTHORS: YAMAMOTO M, DEP. CHEMISTRY, FAC. SCIENCE, NARA WOMEN'S UNIV.
LICENSE: CC BY-NC-SA

CH$NAME: 1,1,2,2-TETRAMETHYLDISILANE (1,2-D2)
CH$COMPOUND_CLASS: N/A
CH$FORMULA: C4H14Si2
CH$EXACT_MASS: 118.06340
CH$SMILES: [2H][Si](C)(C)[Si]([2H])(C)C
CH$IUPAC: InChI=1S/C4H14Si2/c1-5(2)6(3)4/h5-6H,1-4H3/i5D,6D
CH$LINK: INCHIKEY RDWAGGBALVFUHB-KCZCTXNHSA-N
CH$LINK: PUBCHEM CID:101320248

AC$INSTRUMENT: HITACHI RMU-6M
AC$INSTRUMENT_TYPE: EI-B
AC$MASS_SPECTROMETRY: MS_TYPE MS
AC$MASS_SPECTROMETRY: ION_MODE POSITIVE
AC$MASS_SPECTROMETRY: IONIZATION_ENERGY 20 eV

MS$FOCUSED_ION: ION_TYPE [M]+*

PK$SPLASH: splash10-074i-9300000000-100c10aa8846f2c5e89a
PK$NUM_PEAK: 33
PK$PEAK: m/z int. rel.int.
  28 1.1 11
  31 1.5 15
  32 1.1 11
  43 16.6 166
  44 2.9 29
  45 2.2 22
  52 1.3 13
  57 1.4 14
  58 75.9 759
  59 10.4 104
  60 99.99 999
  61 7.4 74
  62 3.7 37
  72 1.7 17
  73 87.4 874
  74 11.3 113
  75 4 40
  77 1.3 13
  86 1.4 14
  88 1.6 16
  101 3.2 32
  102 2.9 29
  103 11.2 112
  104 2.4 24
  105 31.1 311
  106 4.2 42
  107 2.8 28
  116 1.1 11
  118 5.3 53
  119 1.8 18
  120 46.1 461
  121 6.8 68
  122 3.4 34