ACCESSION: MSBNK-Fac_Eng_Univ_Tokyo-JP011672
RECORD_TITLE: (2,2,2-TRIMETHYL-1-PHENYL-1-(ORTHO-TOLYL)DISILANYL)(TRIMETHYLSILYL)ACETYLENE; EI-B; MS
DATE: 2016.01.19 (Created 2008.10.21, modified 2011.05.06)
AUTHORS: FAC. TECHNOLOGY, HIROSHIMA UNIV.
LICENSE: CC BY-NC-SA

CH$NAME: (2,2,2-TRIMETHYL-1-PHENYL-1-(ORTHO-TOLYL)DISILANYL)(TRIMETHYLSILYL)ACETYLENE
CH$COMPOUND_CLASS: N/A
CH$FORMULA: C21H30Si3
CH$EXACT_MASS: 366.16553
CH$SMILES: C[Si](C)(C)C#C[Si](c(c2)cccc2)(c(c1)c(C)ccc1)[Si](C)(C)C
CH$IUPAC: InChI=1S/C21H30Si3/c1-19-13-11-12-16-21(19)24(23(5,6)7,18-17-22(2,3)4)20-14-9-8-10-15-20/h8-16H,1-7H3
CH$LINK: INCHIKEY YYJZUVLJBORMQL-UHFFFAOYSA-N

AC$INSTRUMENT: SHIMADZU QP-1000
AC$INSTRUMENT_TYPE: EI-B
AC$MASS_SPECTROMETRY: MS_TYPE MS
AC$MASS_SPECTROMETRY: ION_MODE POSITIVE
AC$MASS_SPECTROMETRY: IONIZATION_ENERGY 20 eV

MS$FOCUSED_ION: ION_TYPE [M]+*

PK$SPLASH: splash10-029f-1793000000-2bba71cc473167385aa8
PK$NUM_PEAK: 82
PK$PEAK: m/z int. rel.int.
  43 3.2 32
  58 1.1 11
  59 1.1 11
  73 52.1 521
  74 3.2 32
  75 1.1 11
  78 1.1 11
  105 3.2 32
  115 1.1 11
  116 17 170
  117 2.1 21
  118 6.4 64
  119 3.2 32
  133 3.2 32
  134 2.1 21
  135 71.3 713
  136 9.6 96
  137 3.2 32
  140 4.3 43
  143 3.2 32
  145 4.3 43
  148 6.4 64
  149 64.9 649
  150 9.6 96
  151 2.1 21
  155 8.5 85
  163 7.4 74
  165 6.4 64
  177 14.9 149
  178 52.1 521
  179 10.6 106
  180 3.2 32
  181 2.1 21
  187 2.1 21
  191 6.4 64
  192 20.2 202
  193 5.3 53
  194 3.2 32
  195 12.8 128
  196 8.5 85
  197 1.1 11
  201 16 160
  202 18.1 181
  203 4.3 43
  204 1.1 11
  205 1.1 11
  209 3.2 32
  210 4.3 43
  211 77.7 777
  212 16 160
  213 3.2 32
  215 10.6 106
  216 26.6 266
  217 25.5 255
  218 6.4 64
  219 3.2 32
  230 6.4 64
  231 50 500
  232 12.8 128
  233 9.6 96
  245 1.1 11
  259 2.1 21
  263 6.4 64
  273 3.2 32
  275 1.1 11
  277 5.3 53
  278 4.3 43
  279 1.1 11
  291 1.1 11
  292 2.1 21
  293 99.99 999
  294 31.9 319
  295 10.6 106
  296 1.1 11
  307 1.1 11
  351 22.3 223
  352 7.4 74
  353 3.2 32
  366 80.9 809
  367 31.9 319
  368 11.7 117
  369 2.1 21