ACCESSION: MSBNK-Fac_Eng_Univ_Tokyo-JP011676
RECORD_TITLE: 1,1-DIPHENYLTETRAMETHYLDISILANE; EI-B; MS
DATE: 2016.01.19 (Created 2008.10.21, modified 2011.05.06)
AUTHORS: FAC. TECHNOLOGY, HIROSHIMA UNIV.
LICENSE: CC BY-NC-SA

CH$NAME: 1,1-DIPHENYLTETRAMETHYLDISILANE
CH$COMPOUND_CLASS: N/A
CH$FORMULA: C16H22Si2
CH$EXACT_MASS: 270.12600
CH$SMILES: c(c2)ccc(c2)[Si](C)(c(c1)cccc1)[Si](C)(C)C
CH$IUPAC: InChI=1S/C16H22Si2/c1-17(2,3)18(4,15-11-7-5-8-12-15)16-13-9-6-10-14-16/h5-14H,1-4H3
CH$LINK: INCHIKEY ZQZXXLQCPQMXIO-UHFFFAOYSA-N
CH$LINK: COMPTOX DTXSID30162862

AC$INSTRUMENT: SHIMADZU QP-1000
AC$INSTRUMENT_TYPE: EI-B
AC$MASS_SPECTROMETRY: MS_TYPE MS
AC$MASS_SPECTROMETRY: ION_MODE POSITIVE
AC$MASS_SPECTROMETRY: IONIZATION_ENERGY 70 eV

MS$FOCUSED_ION: ION_TYPE [M]+*

PK$SPLASH: splash10-0002-2910000000-a29160204f2b715680a2
PK$NUM_PEAK: 47
PK$PEAK: m/z int. rel.int.
  52 1.4 14
  53 1.4 14
  54 12 120
  55 12 120
  56 2.8 28
  58 2.8 28
  59 2.1 21
  60 2.1 21
  67 2.1 21
  69 2.1 21
  73 33.8 338
  74 3.5 35
  75 1.4 14
  77 1.4 14
  79 4.2 42
  91 3.5 35
  93 9.2 92
  95 1.4 14
  102 2.1 21
  103 2.1 21
  105 36.6 366
  106 4.2 42
  107 7.7 77
  119 10.6 106
  120 5.6 56
  121 3.5 35
  135 67.6 676
  136 8.5 85
  137 2.1 21
  145 1.4 14
  155 1.4 14
  165 6.3 63
  177 2.1 21
  179 2.1 21
  180 2.8 28
  181 11.3 113
  182 3.5 35
  193 2.8 28
  195 13.4 134
  197 99.99 999
  198 41.5 415
  199 9.9 99
  255 10.6 106
  256 2.1 21
  270 26.8 268
  271 6.3 63
  272 2.1 21