ACCESSION: MSBNK-Fac_Eng_Univ_Tokyo-JP011715
RECORD_TITLE: 1,2-DI(DEUTERIOETHYNYL)-1,1,2,2-TETRAPHENYL-DISILANE; EI-B; MS
DATE: 2016.01.19 (Created 2008.10.21, modified 2011.05.06)
AUTHORS: FAC. TECHNOLOGY, HIROSHIMA UNIV.
LICENSE: CC BY-NC-SA

CH$NAME: 1,2-DI(DEUTERIOETHYNYL)-1,1,2,2-TETRAPHENYL-DISILANE
CH$COMPOUND_CLASS: N/A
CH$FORMULA: C28H22Si2
CH$EXACT_MASS: 414.12600
CH$SMILES: c(c1)cccc1[Si](C#C[2H])(c(c4)cccc4)[Si](C#C[2H])(c(c3)cccc3)c(c2)cccc2
CH$IUPAC: InChI=1S/C28H22Si2/c1-3-29(25-17-9-5-10-18-25,26-19-11-6-12-20-26)30(4-2,27-21-13-7-14-22-27)28-23-15-8-16-24-28/h1-2,5-24H/i1D,2D
CH$LINK: INCHIKEY BWYKIYGPAWQNGN-QDNHWIQGSA-N

AC$INSTRUMENT: SHIMADZU QP-1000
AC$INSTRUMENT_TYPE: EI-B
AC$MASS_SPECTROMETRY: MS_TYPE MS
AC$MASS_SPECTROMETRY: ION_MODE POSITIVE
AC$MASS_SPECTROMETRY: IONIZATION_ENERGY 70 eV

MS$FOCUSED_ION: ION_TYPE [M]+*

PK$SPLASH: splash10-0a4i-3930000000-3e3acfaa61a136873116
PK$NUM_PEAK: 54
PK$PEAK: m/z int. rel.int.
  39 1.4 14
  43 2.8 28
  44 1.4 14
  51 5.6 56
  52 1.4 14
  53 40.1 401
  54 35.9 359
  55 5.6 56
  56 1.4 14
  77 7 70
  78 6.3 63
  79 14.8 148
  80 3.5 35
  103 24.6 246
  104 10.6 106
  105 99.99 999
  106 16.9 169
  107 4.2 42
  129 21.8 218
  130 21.8 218
  131 7 70
  132 3.5 35
  152 2.1 21
  153 3.5 35
  154 2.1 21
  155 25.4 254
  156 8.5 85
  157 2.8 28
  165 2.1 21
  166 1.4 14
  178 1.4 14
  179 9.2 92
  180 18.3 183
  181 62 620
  182 16.9 169
  183 12 120
  184 2.8 28
  204 1.4 14
  205 3.5 35
  206 5.6 56
  207 21.1 211
  208 90.8 908
  209 16.2 162
  210 4.2 42
  259 10.6 106
  261 2.8 28
  309 1.4 14
  338 2.8 28
  339 3.5 35
  340 2.1 21
  415 4.2 42
  416 12.7 127
  417 11.3 113
  418 4.2 42