ACCESSION: MSBNK-Fac_Eng_Univ_Tokyo-JP012013
RECORD_TITLE: 1,2-DIETHYL-1,2-DIMETHYLDISILANE; EI-B; MS
DATE: 2016.01.19 (Created 2008.10.21, modified 2011.05.06)
AUTHORS: YAMAMOTO M, DEP. CHEMISTRY, FAC. SCIENCE, NARA WOMEN'S UNIV.
LICENSE: CC BY-NC-SA

CH$NAME: 1,2-DIETHYL-1,2-DIMETHYLDISILANE
CH$COMPOUND_CLASS: N/A
CH$FORMULA: C6H18Si2
CH$EXACT_MASS: 146.09470
CH$SMILES: CC[SiH](C)[SiH](C)CC
CH$IUPAC: InChI=1S/C6H18Si2/c1-5-7(3)8(4)6-2/h7-8H,5-6H2,1-4H3
CH$LINK: INCHIKEY FYFFMJYIIZPDAG-UHFFFAOYSA-N

AC$INSTRUMENT: HITACHI RMU-6M
AC$INSTRUMENT_TYPE: EI-B
AC$MASS_SPECTROMETRY: MS_TYPE MS
AC$MASS_SPECTROMETRY: ION_MODE POSITIVE
AC$MASS_SPECTROMETRY: IONIZATION_ENERGY 70 eV

MS$FOCUSED_ION: ION_TYPE [M]+*

PK$SPLASH: splash10-00dj-9200000000-ecf30a06950b65fa783b
PK$NUM_PEAK: 61
PK$PEAK: m/z int. rel.int.
  28 2.7 27
  29 3.6 36
  30 6.9 69
  32 4.5 45
  33 1.1 11
  40 1.3 13
  41 1.6 16
  42 2.3 23
  43 37.9 379
  44 22 220
  45 78.7 787
  46 5.4 54
  47 2.6 26
  53 3 30
  54 1.2 12
  55 4.7 47
  56 1.6 16
  57 6.2 62
  58 2.3 23
  59 26.7 267
  60 2.5 25
  67 1.8 18
  68 3.1 31
  69 7.2 72
  70 4.2 42
  71 9.4 94
  72 99.99 999
  73 85.4 854
  74 11.9 119
  75 8 80
  76 1.8 18
  77 1.2 12
  81 2 20
  82 2 20
  83 1.9 19
  84 1.6 16
  85 6.4 64
  86 7.6 76
  87 25.3 253
  88 12.1 121
  89 48.9 489
  90 7 70
  91 4.3 43
  99 1.6 16
  100 4 40
  101 12.6 126
  102 7.2 72
  103 11.2 112
  104 2.4 24
  105 1.5 15
  117 20.3 203
  118 3.5 35
  119 1.8 18
  130 5 50
  131 5 50
  132 1.4 14
  133 1.4 14
  145 3.7 37
  146 43 430
  147 8 80
  148 3.7 37