ACCESSION: MSBNK-Fac_Eng_Univ_Tokyo-JP012018
RECORD_TITLE: 1,2-BIS(TRIMETHYLSILYL)ETHANE; EI-B; MS
DATE: 2016.01.19 (Created 2008.10.21, modified 2011.05.06)
AUTHORS: YAMAMOTO M, DEP. CHEMISTRY, FAC. SCIENCE, NARA WOMEN'S UNIV.
LICENSE: CC BY-NC-SA

CH$NAME: 1,2-BIS(TRIMETHYLSILYL)ETHANE
CH$COMPOUND_CLASS: N/A
CH$FORMULA: C8H22Si2
CH$EXACT_MASS: 174.12600
CH$SMILES: C[Si](C)(C)CC[Si](C)(C)C
CH$IUPAC: InChI=1S/C8H22Si2/c1-9(2,3)7-8-10(4,5)6/h7-8H2,1-6H3
CH$LINK: INCHIKEY DMKCEJPDZDUPDV-UHFFFAOYSA-N
CH$LINK: COMPTOX DTXSID00211376

AC$INSTRUMENT: HITACHI RMU-6M
AC$INSTRUMENT_TYPE: EI-B
AC$MASS_SPECTROMETRY: MS_TYPE MS
AC$MASS_SPECTROMETRY: ION_MODE POSITIVE
AC$MASS_SPECTROMETRY: IONIZATION_ENERGY 70 eV

MS$FOCUSED_ION: ION_TYPE [M]+*

PK$SPLASH: splash10-00di-9100000000-91102352c09056b869dc
PK$NUM_PEAK: 25
PK$PEAK: m/z int. rel.int.
  28 1.9 19
  29 3.6 36
  31 2.6 26
  43 8 80
  44 3.8 38
  45 14.9 149
  55 1.9 19
  57 2 20
  58 10.7 107
  59 9.2 92
  72 3 30
  73 99.99 999
  74 9.6 96
  75 4.1 41
  85 16.2 162
  86 26.6 266
  87 4.7 47
  88 1.8 18
  131 8.6 86
  159 11.4 114
  160 4.1 41
  161 1.8 18
  174 11 110
  175 2.1 21
  176 1 10