ACCESSION: MSBNK-Fac_Eng_Univ_Tokyo-JP012033
RECORD_TITLE: 1,2-DIBUTYL-1,2-DIMETHYLDISILANE; EI-B; MS
DATE: 2016.01.19 (Created 2008.10.21, modified 2011.05.06)
AUTHORS: YAMAMOTO M, DEP. CHEMISTRY, FAC. SCIENCE, NARA WOMEN'S UNIV.
LICENSE: CC BY-NC-SA

CH$NAME: 1,2-DIBUTYL-1,2-DIMETHYLDISILANE
CH$COMPOUND_CLASS: N/A
CH$FORMULA: C10H26Si2
CH$EXACT_MASS: 202.15730
CH$SMILES: CCCC[SiH](C)[SiH](C)CCCC
CH$IUPAC: InChI=1S/C10H26Si2/c1-5-7-9-11(3)12(4)10-8-6-2/h11-12H,5-10H2,1-4H3
CH$LINK: INCHIKEY NSYKINUQOKOVNW-UHFFFAOYSA-N

AC$INSTRUMENT: HITACHI RMU-6M
AC$INSTRUMENT_TYPE: EI-B
AC$MASS_SPECTROMETRY: MS_TYPE MS
AC$MASS_SPECTROMETRY: ION_MODE POSITIVE
AC$MASS_SPECTROMETRY: IONIZATION_ENERGY 70 eV

MS$FOCUSED_ION: ION_TYPE [M]+*

PK$SPLASH: splash10-0kmi-9100000000-33d5bab3dc05e2f20bfe
PK$NUM_PEAK: 59
PK$PEAK: m/z int. rel.int.
  27 9.2 92
  28 1.9 19
  29 9.5 95
  31 3.5 35
  39 3 30
  41 4.3 43
  42 1.9 19
  43 40.7 407
  44 8.9 89
  45 61 610
  46 3.5 35
  47 2.7 27
  53 1.4 14
  54 1.1 11
  55 5.4 54
  56 1.4 14
  57 4.9 49
  58 15.7 157
  59 97.6 976
  60 7.3 73
  61 3.5 35
  67 1.1 11
  69 2.7 27
  70 1.6 16
  71 11.9 119
  72 99.99 999
  73 39.8 398
  74 6.8 68
  75 3.8 38
  83 2.4 24
  84 1.4 14
  85 34.7 347
  86 8.7 87
  87 15.2 152
  88 10.8 108
  89 33.1 331
  90 4.9 49
  91 2.7 27
  97 1.4 14
  99 6.8 68
  100 36.6 366
  101 27.9 279
  102 4.1 41
  103 9.5 95
  104 1.6 16
  105 2.2 22
  115 3.8 38
  117 3.3 33
  121 2.7 27
  130 1.4 14
  131 2.7 27
  145 4.1 41
  146 1.1 11
  157 1.4 14
  186 1.4 14
  187 1.4 14
  202 16.8 168
  203 3.8 38
  204 1.4 14