ACCESSION: MSBNK-Fac_Eng_Univ_Tokyo-JP012035
RECORD_TITLE: 1,1-DIMETHYL-2,2-DIPROPYLDISILANE; EI-B; MS
DATE: 2016.01.19 (Created 2008.10.21, modified 2011.05.06)
AUTHORS: YAMAMOTO M, DEP. CHEMISTRY, FAC. SCIENCE, NARA WOMEN'S UNIV.
LICENSE: CC BY-NC-SA

CH$NAME: 1,1-DIMETHYL-2,2-DIPROPYLDISILANE
CH$COMPOUND_CLASS: N/A
CH$FORMULA: C8H22Si2
CH$EXACT_MASS: 174.12600
CH$SMILES: CCC[SiH](CCC)[SiH](C)C
CH$IUPAC: InChI=1S/C8H22Si2/c1-5-7-10(8-6-2)9(3)4/h9-10H,5-8H2,1-4H3
CH$LINK: INCHIKEY UFXQZDUFUWDYOA-UHFFFAOYSA-N

AC$INSTRUMENT: HITACHI RMU-6M
AC$INSTRUMENT_TYPE: EI-B
AC$MASS_SPECTROMETRY: MS_TYPE MS
AC$MASS_SPECTROMETRY: ION_MODE POSITIVE
AC$MASS_SPECTROMETRY: IONIZATION_ENERGY 70 eV

MS$FOCUSED_ION: ION_TYPE [M]+*

PK$SPLASH: splash10-022i-7900000000-c12a247bcd7c9caf5d4a
PK$NUM_PEAK: 44
PK$PEAK: m/z int. rel.int.
  43 8.8 88
  44 5.3 53
  45 9.6 96
  55 5.3 53
  57 5.3 53
  58 7 70
  59 15.8 158
  69 5.3 53
  70 6.1 61
  71 9.6 96
  72 25.4 254
  73 26.3 263
  74 8.8 88
  75 6.1 61
  85 13.2 132
  86 42.1 421
  87 24.6 246
  88 13.2 132
  89 26.3 263
  90 7 70
  91 5.3 53
  99 7.9 79
  100 5.3 53
  101 7.9 79
  102 4.4 44
  103 13.1 131
  104 5.3 53
  105 6.1 61
  114 99.99 999
  115 29.8 298
  116 14 140
  117 12.3 123
  118 4.4 44
  119 4.4 44
  129 7.9 79
  130 6.1 61
  131 11.4 114
  158 7 70
  159 7 70
  160 5.3 53
  173 9.6 96
  174 50.9 509
  175 14 140
  176 7 70