ACCESSION: MSBNK-Fac_Eng_Univ_Tokyo-JP012282
RECORD_TITLE: 1,2,3,5-TETRAMETHYLBENZENE; CI-B; MS
DATE: 2016.01.19 (Created 2008.10.21, modified 2011.05.06)
AUTHORS: IIDA Y, DAISHIMA S, FAC. OF ENGINEERING, SEIKEI UNIV.
LICENSE: CC BY-NC-SA

CH$NAME: 1,2,3,5-TETRAMETHYLBENZENE
CH$COMPOUND_CLASS: N/A
CH$FORMULA: C10H14
CH$EXACT_MASS: 134.10955
CH$SMILES: Cc(c1)cc(C)c(C)c(C)1
CH$IUPAC: InChI=1S/C10H14/c1-7-5-8(2)10(4)9(3)6-7/h5-6H,1-4H3
CH$LINK: CAS 527-53-7
CH$LINK: INCHIKEY BFIMMTCNYPIMRN-UHFFFAOYSA-N
CH$LINK: COMPTOX DTXSID6026119

AC$INSTRUMENT: FINNIGAN-MAT 4500
AC$INSTRUMENT_TYPE: CI-B
AC$MASS_SPECTROMETRY: MS_TYPE MS
AC$MASS_SPECTROMETRY: ION_MODE POSITIVE
AC$MASS_SPECTROMETRY: IONIZATION_ENERGY 120 eV
AC$MASS_SPECTROMETRY: REAGENT_GAS METHANE

PK$SPLASH: splash10-000i-0900000000-46a3ec699bb19435b1e2
PK$NUM_PEAK: 8
PK$PEAK: m/z int. rel.int.
  119 1.22 12
  133 35.62 356
  134 13.66 137
  135 99.99 999
  136 10.87 109
  163 14.33 143
  164 1.83 18
  175 2.88 29