ACCESSION: MSBNK-Fac_Eng_Univ_Tokyo-JP012331
RECORD_TITLE: 1,2-DIHYDRONAPHTHALENE; CI-B; MS
DATE: 2016.01.19 (Created 2008.10.21, modified 2011.05.06)
AUTHORS: IIDA Y, DAISHIMA S, FAC. OF ENGINEERING, SEIKEI UNIV.
LICENSE: CC BY-NC-SA

CH$NAME: 1,2-DIHYDRONAPHTHALENE
CH$COMPOUND_CLASS: N/A
CH$FORMULA: C10H10
CH$EXACT_MASS: 130.07825
CH$SMILES: [H]C(C1)=C([H])c(c2)c(ccc2)C1
CH$IUPAC: InChI=1S/C10H10/c1-2-6-10-8-4-3-7-9(10)5-1/h1-3,5-7H,4,8H2
CH$LINK: CAS 447-53-0
CH$LINK: INCHIKEY KEIFWROAQVVDBN-UHFFFAOYSA-N
CH$LINK: COMPTOX DTXSID30858713

AC$INSTRUMENT: FINNIGAN-MAT 4500
AC$INSTRUMENT_TYPE: CI-B
AC$MASS_SPECTROMETRY: MS_TYPE MS
AC$MASS_SPECTROMETRY: ION_MODE POSITIVE
AC$MASS_SPECTROMETRY: IONIZATION_ENERGY 120 eV
AC$MASS_SPECTROMETRY: REAGENT_GAS METHANE

PK$SPLASH: splash10-001i-0900000000-65b87ff14a89dcf251f0
PK$NUM_PEAK: 9
PK$PEAK: m/z int. rel.int.
  117 3.81 38
  129 8.83 88
  130 9.92 99
  131 99.99 999
  132 11.32 113
  133 1.21 12
  159 20.95 210
  160 2.76 28
  171 4.18 42