ACCESSION: MSBNK-NAIST-KNA00221
RECORD_TITLE: FAD; LC-ESI-ITFT; MS; POS
DATE: 2016.01.19 (Created 2009.11.17, modified 2011.08.03)
AUTHORS: Takahashi H, Kanaya S, Ogasawara N, Graduate School of Information Science, NAIST
LICENSE: CC BY-SA

CH$NAME: FAD
CH$NAME: Flavin adenine dinucleotide
CH$COMPOUND_CLASS: Natural Product
CH$FORMULA: C27H33N9O15P2
CH$EXACT_MASS: 785.15713
CH$SMILES: C(C(CN(c54)C(=N6)C(C(=O)NC6=O)=Nc(cc(c(c5)C)C)4)O)(O)C(O)COP(OP(OCC(O1)C(C(C1n(c2)c(n3)c(c(N)nc3)n2)O)O)(O)=O)(O)=O
CH$IUPAC: InChI=1S/C27H33N9O15P2/c1-10-3-12-13(4-11(10)2)35(24-18(32-12)25(42)34-27(43)33-24)5-14(37)19(39)15(38)6-48-52(44,45)51-53(46,47)49-7-16-20(40)21(41)26(50-16)36-9-31-17-22(28)29-8-30-23(17)36/h3-4,8-9,14-16,19-21,26,37-41H,5-7H2,1-2H3,(H,44,45)(H,46,47)(H2,28,29,30)(H,34,42,43)/t14-,15+,16+,19-,20+,21+,26+/m0/s1
CH$LINK: CAS 146-14-5
CH$LINK: CHEBI 16238
CH$LINK: KEGG C00016
CH$LINK: KNAPSACK C00001500
CH$LINK: NIKKAJI J39.053D
CH$LINK: PUBCHEM 3318
CH$LINK: INCHIKEY VWWQXMAJTJZDQX-UYBVJOGSSA-N
CH$LINK: COMPTOX DTXSID4048307

AC$INSTRUMENT: LTQ Orbitrap XL, Thermo Scientfic
AC$INSTRUMENT_TYPE: LC-ESI-ITFT
AC$MASS_SPECTROMETRY: MS_TYPE MS
AC$MASS_SPECTROMETRY: ION_MODE POSITIVE
AC$MASS_SPECTROMETRY: COLLISION_ENERGY 35eV
AC$MASS_SPECTROMETRY: IONIZATION ESI
AC$CHROMATOGRAPHY: COLUMN_NAME TOSOH TSKgel ODS-100V 5um Part no. 21456
AC$CHROMATOGRAPHY: FLOW_GRADIENT 0min:3%, 45min:97%, 50min:97%, 50.1:3%, 57min:3% (acetonitrile)
AC$CHROMATOGRAPHY: FLOW_RATE 0.5 ml/min
AC$CHROMATOGRAPHY: RETENTION_TIME 14.661962 min
AC$CHROMATOGRAPHY: SOLVENT A 0.1%formate-water
AC$CHROMATOGRAPHY: SOLVENT B 0.1%formate-acetonitrile

MS$FOCUSED_ION: BASE_PEAK 348.069885

PK$SPLASH: splash10-000j-0908600300-e469a62e81691b92bce2
PK$NUM_PEAK: 491
PK$PEAK: m/z int. rel.int.
  100.075531 2361.354004 1
  100.110713 4232.483887 1
  100.111848 271177.593750 66
  100.113362 6266.774414 2
  100.509596 2563.858887 1
  101.095891 4503.099609 1
  101.115285 5994.928223 1
  102.032385 3750.082520 1
  102.033553 215265.281250 52
  102.035111 4347.572754 1
  102.091007 80877.039063 20
  102.092566 2733.320801 1
  102.535127 12782.014648 3
  103.086257 3786.888184 1
  107.069996 14126.625977 3
  109.022163 17407.373047 4
  109.521199 4632.546387 1
  109.977907 2566.084473 1
  110.008195 3155.438477 1
  110.016041 3043.198730 1
  110.018220 6926.181641 2
  110.019746 431785.812500 104
  110.020836 7846.062500 2
  110.021490 8200.559570 2
  110.039802 2133.825195 1
  110.518193 2281.749512 1
  110.520168 2431.966309 1
  110.521266 22098.531250 5
  111.020036 91675.953125 22
  111.521299 3325.111816 1
  112.017680 38886.425781 9
  112.111568 3458.272461 1
  113.016576 3013.784180 1
  113.059026 3609.028809 1
  113.106725 3976.829590 1
  113.963144 14202.777344 3
  113.964293 2900.848633 1
  114.072836 2267.742188 1
  114.090788 3183.179199 1
  114.127396 10721.373047 3
  116.523841 3089.708984 1
  119.013487 2122.701172 1
  119.063287 4074.729980 1
  121.959429 2378.191406 1
  122.963861 12634.996094 3
  123.055085 57838.132813 14
  125.986481 2178.363281 1
  128.106709 50861.039063 12
  128.142869 2195.944824 1
  129.127203 7084.919434 2
  130.007488 3837.798828 1
  130.122081 3694.999512 1
  130.158817 64745.757813 16
  130.491545 16543.279297 4
  133.079206 60032.609375 15
  133.085295 2149.364746 1
  135.101048 8968.271484 2
  136.021355 7679.278320 2
  136.057919 3280.157227 1
  136.061516 70267.992188 17
  137.132305 51758.460938 13
  137.986490 2395.049316 1
  139.497138 2425.798828 1
  139.982008 19353.214844 5
  139.987326 2698.865234 1
  141.958171 7003.458496 2
  142.122204 3782.347168 1
  142.158694 2725.743164 1
  144.982190 2580.099121 1
  145.132998 3227.439941 1
  149.023248 150045.828125 36
  149.025653 2597.541504 1
  149.951554 2193.113281 1
  149.954675 2250.764648 1
  149.966469 6757.874512 2
  150.026151 3456.830078 1
  151.005209 2139.069824 1
  151.035005 3207.180176 1
  151.096379 27246.466797 7
  154.990068 57913.140625 14
  155.142891 68330.640625 17
  156.145638 2207.875488 1
  157.133580 3240.958984 1
  158.000302 3169.089844 1
  158.002552 99265.015625 24
  158.089621 2679.508301 1
  158.096003 87195.125000 21
  158.117032 2345.079102 1
  158.961247 42241.703125 10
  159.099511 4448.017090 1
  159.103680 3525.739258 1
  159.112399 7754.121094 2
  161.002966 2167.690918 1
  161.110679 5673.990723 1
  161.116859 3299.350586 1
  161.132698 2258.379395 1
  162.997765 69390.234375 17
  163.130310 4154.374023 1
  163.132671 286670.093750 69
  163.135820 4525.962891 1
  163.138969 2442.885742 1
  163.998385 2303.211426 1
  164.135727 7771.038086 2
  165.136839 2408.643555 1
  167.012526 9838.433594 2
  167.033727 25348.808594 6
  168.123257 4063.615234 1
  169.977345 2220.062012 1
  170.096285 131767.703125 32
  171.100077 6966.641602 2
  171.110223 6116.093262 1
  171.133478 2326.544922 1
  171.138553 57419.878906 14
  171.140244 4468.061523 1
  171.141936 11247.291016 3
  171.143205 7323.980957 2
  171.146165 26081.140625 6
  171.149125 1859282.375000 450
  171.151240 30314.386719 7
  171.152509 30115.201172 7
  171.154201 4678.823242 1
  171.155892 9552.459961 2
  171.157161 4849.536133 1
  171.158853 4576.032715 1
  171.188041 7035.540527 2
  171.265911 3220.626465 1
  172.132828 2284.916992 1
  172.140933 3896.375000 1
  172.145626 5700.485352 1
  172.152452 131772.109375 32
  172.155439 3004.700195 1
  172.169092 14438.688477 3
  173.029557 2322.537598 1
  173.078147 10178.583984 2
  173.155159 2669.139648 1
  174.087228 2130.476074 1
  174.120206 3558.307129 1
  174.121508 3429.441406 1
  174.124980 10218.446289 2
  174.127584 817454.437500 198
  174.129754 13357.693359 3
  174.131056 12858.487305 3
  174.134528 4803.454590 1
  174.167520 3167.752441 1
  175.035155 2241.332031 1
  175.089406 37870.835938 9
  175.130548 73126.250000 18
  176.012896 4208.487305 1
  176.093199 2521.085449 1
  176.142644 4276.964844 1
  178.034839 24325.066406 6
  178.036634 4046.279297 1
  179.063653 200310.281250 48
  179.065916 2332.737793 1
  180.066718 5769.632813 1
  180.158947 4826.464355 1
  180.989441 2082.553223 1
  181.058907 3534.208496 1
  182.984796 108874.546875 26
  183.988506 2217.065430 1
  184.466484 2078.819336 1
  184.467904 2539.332031 1
  184.985290 3001.646484 1
  185.114619 22766.728516 6
  186.184865 46471.449219 11
  186.955984 34281.378906 8
  187.123159 7937.191406 2
  187.126060 550351.187500 133
  187.129928 7667.342773 2
  187.133797 3353.515625 1
  188.128987 28333.707031 7
  188.143122 3117.297363 1
  188.997594 5502.650391 1
  189.121821 8749.343750 2
  189.995837 4747.309570 1
  190.049767 2381.949219 1
  190.158191 3616.340820 1
  190.978577 6334.930664 2
  190.992536 149049.312500 36
  191.995591 3750.950684 1
  192.975678 2908.959473 1
  192.989350 4931.310059 1
  193.066853 3522.799805 1
  194.116962 21720.675781 5
  194.974441 3239.155273 1
  195.087107 7783.711914 2
  195.122110 35360.601563 9
  195.993002 3574.860840 1
  196.125747 2106.510254 1
  196.153765 2307.001953 1
  198.184317 3017.302734 1
  199.028604 31012.960938 7
  199.176656 4080.678223 1
  199.180373 340268.843750 82
  199.183028 2777.044922 1
  199.184621 5167.461914 1
  199.987228 22697.123047 5
  200.183421 22554.242188 5
  200.200542 2377.274414 1
  204.137860 4209.290039 1
  207.094940 2343.027832 1
  208.190213 3973.904785 1
  212.148906 2172.567871 1
  214.215434 3655.398438 1
  215.157172 8800.182617 2
  216.027148 2478.171387 1
  216.173558 2605.722168 1
  217.104082 23629.238281 6
  218.153176 2602.284180 1
  219.122867 2650.987305 1
  220.111375 72055.421875 17
  221.114659 4998.738770 1
  222.111688 10892.151367 3
  223.062608 6290.911621 2
  223.116735 2647.934570 1
  224.127351 9116.460938 2
  225.195268 5776.894043 1
  226.158371 21628.515625 5
  226.215557 2173.891602 1
  227.982221 4667.577148 1
  228.194985 2487.399902 1
  228.231451 20517.042969 5
  232.169093 5003.353027 1
  233.173966 67481.445313 16
  234.177930 3949.584473 1
  239.147498 2222.426270 1
  240.179785 7173.736816 2
  240.231117 2244.453613 1
  243.087108 2874.890137 1
  253.163818 8339.416016 2
  255.155217 5625.348633 1
  256.145801 3603.502930 1
  256.175228 2319.464844 1
  256.262765 5687.151855 1
  261.147263 3227.830078 1
  264.131509 7465.232422 2
  264.633311 2694.471191 1
  268.082647 3237.899414 1
  272.200287 2747.380371 1
  275.145377 9023.823242 2
  275.196246 20173.435547 5
  276.198383 2336.035156 1
  277.200773 38979.496094 9
  279.158552 38155.453125 9
  279.162076 2982.389648 1
  280.161171 2383.551758 1
  282.221186 79171.742188 19
  282.224768 6262.587402 2
  283.224159 6800.784668 2
  283.227760 2366.649902 1
  283.261976 2332.295410 1
  284.207146 2581.423340 1
  289.235929 2359.708984 1
  290.073958 4121.985352 1
  294.226753 7428.808594 2
  294.230566 2663.681641 1
  298.221162 5409.327637 1
  299.181639 22661.378906 5
  300.185074 2116.453125 1
  305.195176 6570.958984 2
  309.130209 3796.436035 1
  312.346843 2705.966797 1
  320.293539 6279.184082 2
  321.225628 10300.321289 2
  321.296325 2144.627930 1
  322.257928 7519.083008 2
  327.177147 6490.559570 2
  327.200623 23133.005859 6
  330.058768 2854.778809 1
  332.206436 2803.172363 1
  338.253223 5791.071289 1
  343.208159 19129.857422 5
  344.211964 3449.913574 1
  344.227646 38076.429688 9
  345.229872 5165.250977 1
  346.193894 2545.887695 1
  347.730786 4750.790527 1
  347.956256 9876.066406 2
  348.024921 3361.915527 1
  348.029827 2831.927246 1
  348.035958 2154.642090 1
  348.039638 6078.492676 1
  348.043317 6109.500977 1
  348.045770 3395.583984 1
  348.049449 8120.204102 2
  348.053129 12855.651367 3
  348.061714 44861.863281 11
  348.070300 4130955.500000 999
  348.080113 47744.746094 12
  348.083793 10407.773438 3
  348.088700 19051.023438 5
  348.093606 9932.568359 2
  348.098513 8571.831055 2
  348.103420 2471.710938 1
  348.105874 3394.037598 1
  348.115688 3367.298340 1
  348.118142 2074.319824 1
  348.181946 10967.056641 3
  348.282596 2774.075684 1
  348.409083 4248.096191 1
  348.711459 2197.724609 1
  349.052411 4047.815918 1
  349.073352 397319.187500 96
  349.083208 4797.589355 1
  349.181783 33103.597656 8
  349.960767 2844.481934 1
  350.073323 27462.769531 7
  350.078272 4493.077637 1
  350.251546 2136.452148 1
  351.076354 2676.732422 1
  353.154302 2138.507813 1
  366.247317 2631.905273 1
  366.283065 5795.938965 1
  371.202105 3751.613770 1
  371.315603 2967.530762 1
  372.258025 10337.509766 2
  381.118630 3906.394531 1
  391.148429 2540.192383 1
  391.259504 3676.066895 1
  391.263889 4829.779297 1
  391.274122 18996.724609 5
  391.284356 1261086.500000 305
  391.296052 12091.279297 3
  391.306286 4678.914551 1
  391.418890 2688.919922 1
  392.277448 4486.916504 1
  392.287721 303275.843750 73
  393.290531 19642.123047 5
  393.296424 2586.931152 1
  393.573541 14957.025391 4
  393.585340 568382.937500 137
  393.597139 6999.146973 2
  394.076932 2645.752930 1
  394.085798 133133.609375 32
  394.587211 18721.105469 5
  395.088098 2366.405762 1
  404.567659 8315.024414 2
  405.070736 2818.913086 1
  405.261751 2798.585938 1
  405.563953 51037.308594 12
  406.064254 6080.533691 1
  406.565480 4374.072266 1
  411.019410 2687.581543 1
  412.547232 2348.834473 1
  412.558312 115215.773438 28
  413.060514 21728.384766 5
  413.263556 20237.972656 5
  413.562046 4033.759277 1
  414.061309 2097.384277 1
  414.268274 6269.642090 2
  414.555099 2192.000488 1
  415.542132 11958.101563 3
  416.044986 2450.083496 1
  419.042476 2952.227539 1
  419.314811 7179.046875 2
  419.548452 6472.961914 2
  420.040710 53340.328125 13
  420.050467 4909.296387 1
  420.533835 5943.987793 1
  420.545238 400266.937500 97
  421.045779 94200.429688 23
  421.080051 4623.045898 1
  421.547215 13360.930664 3
  422.542933 4250.256348 1
  423.550416 3801.471680 1
  424.049736 5725.980469 1
  424.548287 67509.632813 16
  425.049374 19782.128906 5
  425.057650 2141.159180 1
  425.551348 2576.031738 1
  426.047567 2697.449219 1
  426.356690 7277.006348 2
  427.376183 14952.032227 4
  428.032786 2072.637207 1
  428.379239 4505.857910 1
  432.024725 2255.908691 1
  432.527216 2231.472656 1
  435.164302 2931.977539 1
  435.169446 3151.582520 1
  436.341219 24626.789063 6
  436.444534 2858.333496 1
  437.343196 7198.774414 2
  438.620916 2938.943359 1
  438.797952 2152.758789 1
  438.940352 8415.147461 2
  439.035904 2568.262207 1
  439.056755 4508.605469 1
  439.063706 6020.878906 1
  439.070657 13897.959961 3
  439.075871 11116.912109 3
  439.084560 26337.871094 6
  439.089774 41058.953125 10
  439.100201 3804232.000000 920
  439.114105 40815.304688 10
  439.121057 9253.053711 2
  439.128010 13888.910156 3
  439.133224 7130.438477 2
  439.140177 6455.842773 2
  439.260137 8957.249023 2
  439.580272 2746.923340 1
  440.008826 3181.091309 1
  440.080312 2960.287109 1
  440.087288 4406.781738 1
  440.092519 8785.994141 2
  440.102982 673019.500000 163
  440.116934 12477.959961 3
  440.130886 3253.123535 1
  441.105702 44907.472656 11
  441.119701 3429.369141 1
  441.781933 2846.176758 1
  442.106585 5014.934082 1
  457.109366 3709.868164 1
  460.026974 2246.472168 1
  464.370027 3163.891602 1
  464.375697 2598.001953 1
  478.351212 2508.244629 1
  493.018943 2334.198730 1
  494.023318 2437.010742 1
  537.093243 2260.538086 1
  537.429609 3000.210449 1
  542.417793 4276.854004 1
  542.752009 5832.458984 1
  543.088924 2601.515137 1
  785.778586 3215.477051 1
  786.090718 6186.961914 1
  786.107370 4703.751953 1
  786.124023 13352.271484 3
  786.136513 20725.714844 5
  786.161494 2179995.000000 527
  786.194803 17470.744141 4
  786.211459 6069.493652 1
  786.228115 8417.519531 2
  786.244772 3723.499512 1
  786.261429 3583.733398 1
  786.544682 4649.673828 1
  786.628020 2233.717773 1
  786.636355 2098.875488 1
  786.665527 275746.531250 67
  787.128331 2217.449219 1
  787.165874 667957.750000 162
  787.186732 8856.435547 2
  787.199247 7351.598145 2
  787.666698 20204.113281 5
  788.168000 84336.750000 20
  789.172041 8557.874023 2
  797.154848 26745.972656 6
  797.656726 16058.571289 4
  798.142042 4122.661133 1
  798.159078 5732.292969 1
  798.644853 3895.983887 1
  799.143872 3284.136719 1
  804.134048 3773.610352 1
  805.134239 8501.662109 2
  805.635035 6422.527344 2
  808.119998 4666.018555 1
  808.146034 22432.925781 5
  808.623582 3018.397461 1
  809.149374 9214.454102 2
  812.616747 10065.657227 2
  813.120161 36141.238281 9
  813.624044 21314.566406 5
  814.124007 9491.518555 2
  814.624431 6471.450195 2
  817.120250 7702.017578 2
  817.627855 5935.052734 1
  818.127094 2478.454590 1
  824.109105 3336.528320 1
  839.074237 3739.813477 1
  840.080549 14158.420898 3
  841.084064 3165.193359 1
  842.084763 2132.756836 1
  848.089311 4622.270508 1
  1047.888260 2215.975586 1
  1048.221515 2842.542480 1
  1055.548185 2470.670410 1
  1121.982839 2638.768555 1
  1178.744787 20605.488281 5
  1179.241811 19710.667969 5
  1179.746803 12889.951172 3
  1180.252120 3867.246094 1
  1180.750098 2761.769531 1
  1189.729105 5328.773438 1
  1190.233093 2762.661133 1
  1191.242031 2155.789063 1
  1205.700590 4409.980957 1
  1206.705510 2158.862305 1
  1210.204808 2266.011230 1
  1210.705950 2258.476563 1
  1221.987792 5995.772461 1
  1321.992409 5425.994629 1
  1421.967653 2875.582520 1