ACCESSION: MSBNK-NAIST-KNA00507
RECORD_TITLE: L-Tryptophan; LC-ESI-ITFT; MS; NEG
DATE: 2016.01.19 (Created 2009.11.18, modified 2011.08.03)
AUTHORS: Takahashi H, Kanaya S, Ogasawara N, Graduate School of Information Science, NAIST
LICENSE: CC BY-SA

CH$NAME: L-Tryptophan
CH$NAME: Tryptophan
CH$NAME: (S)-alpha-Amino-beta-(3-indolyl)-propionic acid
CH$COMPOUND_CLASS: Natural Product
CH$FORMULA: C11H12N2O2
CH$EXACT_MASS: 204.08988
CH$SMILES: C1=CC=C2C(=C1)C(=CN2)C[C@@H](C(=O)O)N
CH$IUPAC: InChI=1S/C11H12N2O2/c12-9(11(14)15)5-7-6-13-10-4-2-1-3-8(7)10/h1-4,6,9,13H,5,12H2,(H,14,15)/t9-/m0/s1
CH$LINK: CAS 73-22-3
CH$LINK: CHEBI 16828
CH$LINK: KEGG C00078
CH$LINK: KNAPSACK C00001396
CH$LINK: NIKKAJI J9.181B
CH$LINK: PUBCHEM CID:6305
CH$LINK: INCHIKEY QIVBCDIJIAJPQS-VIFPVBQESA-N
CH$LINK: COMPTOX DTXSID5021419

AC$INSTRUMENT: LTQ Orbitrap XL, Thermo Scientfic
AC$INSTRUMENT_TYPE: LC-ESI-ITFT
AC$MASS_SPECTROMETRY: MS_TYPE MS
AC$MASS_SPECTROMETRY: ION_MODE NEGATIVE
AC$MASS_SPECTROMETRY: COLLISION_ENERGY 35eV
AC$MASS_SPECTROMETRY: IONIZATION ESI
AC$CHROMATOGRAPHY: COLUMN_NAME TOSOH TSKgel ODS-100V 5um Part no. 21456
AC$CHROMATOGRAPHY: FLOW_GRADIENT 0min:3%, 45min:97%, 50min:97%, 50.1:3%, 57min:3% (acetonitrile)
AC$CHROMATOGRAPHY: FLOW_RATE 0.5 ml/min
AC$CHROMATOGRAPHY: RETENTION_TIME 13.922268 min
AC$CHROMATOGRAPHY: SOLVENT A 0.1%formate-water
AC$CHROMATOGRAPHY: SOLVENT B 0.1%formate-acetonitrile

MS$FOCUSED_ION: BASE_PEAK 203.081894

PK$SPLASH: splash10-0udi-0290602010-4e2c6b6e432377723f72
PK$NUM_PEAK: 613
PK$PEAK: m/z int. rel.int.
  100.517998 785.845581 1
  100.969237 769.162598 1
  101.732606 867.679077 1
  102.325103 965.410400 1
  103.364919 870.080688 1
  103.920296 3111.087646 3
  105.117421 796.452881 1
  105.249081 799.447632 1
  106.172912 696.829468 1
  106.594574 758.649780 1
  110.371051 797.415894 1
  112.964549 1074.219971 1
  112.981790 2306.324219 2
  112.983832 7576.161133 6
  112.985648 149543.609375 127
  112.987463 6015.123535 5
  112.989278 2412.448242 2
  113.006525 879.635132 1
  113.621829 821.145386 1
  113.989058 1567.077271 1
  114.951389 4393.977539 4
  115.836871 801.081055 1
  116.046790 2677.785156 2
  116.048680 5789.161621 5
  116.050569 138302.593750 117
  116.052223 5976.520996 5
  116.054585 2003.999268 2
  116.152437 750.004761 1
  116.323620 889.653564 1
  116.944506 854.997192 1
  117.045879 893.542847 1
  117.053774 8038.148438 7
  117.597357 771.059326 1
  118.116111 808.088501 1
  118.293600 802.952759 1
  118.759736 786.853394 1
  121.710373 856.705078 1
  121.759602 896.711670 1
  125.961236 821.276489 1
  129.058007 1677.722412 1
  130.066059 6918.649902 6
  131.069239 850.231323 1
  131.734585 763.905029 1
  137.074984 801.922485 1
  138.108358 731.051025 1
  139.006578 2056.221680 2
  140.252516 832.289307 1
  141.045727 962.950317 1
  142.060733 979.258179 1
  142.065852 38811.886719 33
  142.068091 1350.055542 1
  142.946173 1837.004150 2
  143.069598 1910.403564 2
  144.562930 693.461426 1
  145.890149 1051.345581 1
  146.493603 813.396729 1
  146.781782 840.352539 1
  146.965735 1905.367676 2
  148.952117 1210.254639 1
  150.810251 1077.228271 1
  151.550914 744.407959 1
  153.962463 1603.588745 1
  154.973328 1357.151733 1
  157.076841 7308.118652 6
  158.278354 819.260742 1
  159.092598 11827.938477 10
  159.675385 925.453125 1
  161.045036 3065.230957 3
  170.944177 903.276855 1
  172.503198 725.713745 1
  174.838995 1036.368408 1
  180.006931 967.957642 1
  180.166280 1108.252441 1
  183.538130 875.139771 1
  184.505447 1569.063354 1
  185.200602 827.536255 1
  186.055424 5677.009766 5
  187.763475 810.180298 1
  196.634252 763.447876 1
  197.962578 5881.008789 5
  202.369921 751.721802 1
  202.930759 1924.876709 2
  203.022546 1087.414307 1
  203.024185 975.408569 1
  203.031291 6414.295410 5
  203.053702 1891.797363 2
  203.062449 1733.639893 1
  203.068463 5178.071777 4
  203.070103 3258.195801 3
  203.072836 18283.550781 15
  203.074477 15632.115234 13
  203.077757 35924.417969 30
  203.082131 1180140.375000 999
  203.085959 39327.867188 33
  203.090880 17242.724609 15
  203.094708 3747.466797 3
  203.096348 2266.480713 2
  203.100176 2595.776855 2
  203.101817 2096.264893 2
  203.105645 2209.383057 2
  203.110020 2210.885986 2
  203.119864 913.647705 1
  203.120958 902.497803 1
  203.132444 5581.834961 5
  203.233126 2052.743896 2
  203.366754 782.965454 1
  204.076526 2246.649658 2
  204.078729 5439.530273 5
  204.080933 3401.984619 3
  204.085339 117121.812500 99
  204.089195 4430.627441 4
  204.094704 1708.954468 1
  205.082127 1731.410645 1
  205.086011 2366.768555 2
  205.088230 5003.806152 4
  205.147617 813.472778 1
  208.785375 959.608276 1
  209.250676 1005.843506 1
  210.998915 1528.315186 1
  213.011529 1904.950439 2
  213.074390 816.808594 1
  217.105983 765.836670 1
  220.965487 768.930786 1
  221.110150 930.655151 1
  225.053162 1316.958984 1
  225.064007 35670.242188 30
  225.516329 787.814575 1
  226.066955 2623.941162 2
  226.977741 1395.710205 1
  227.825161 815.178711 1
  228.013687 7737.486328 7
  229.932309 1090.208618 1
  230.193384 762.083984 1
  233.938884 1054.035767 1
  237.014320 5819.819336 5
  239.047211 1410.772949 1
  239.052797 2113.398926 2
  239.054892 1566.443481 1
  239.058384 90526.351563 77
  239.063971 2904.451416 2
  239.070256 1044.723877 1
  239.916134 940.725586 1
  240.061532 6764.854004 6
  241.049794 1042.144775 1
  241.055451 26105.294922 22
  241.061108 834.768311 1
  242.059113 2375.848877 2
  242.061959 984.667969 1
  245.585746 896.226074 1
  248.142463 765.424316 1
  248.938266 892.812622 1
  248.959787 17879.671875 15
  249.087487 3591.733887 3
  255.024957 1965.041016 2
  257.000751 1248.314819 1
  259.016920 11976.615234 10
  261.040174 53277.019531 45
  261.046549 1071.568726 1
  262.043872 4406.245117 4
  263.037249 11875.557617 10
  264.041149 1037.428223 1
  265.250658 1040.110840 1
  266.077747 14658.618164 12
  267.080977 1388.481934 1
  268.653890 961.209229 1
  271.062624 2064.705811 2
  271.069369 52396.761719 44
  271.075272 1592.528687 1
  272.073007 4612.629883 4
  274.004507 3910.861328 3
  275.011581 3166.563477 3
  276.305147 709.569458 1
  282.530240 803.206787 1
  283.019861 5505.874023 5
  284.022822 1001.666138 1
  287.034501 5158.572754 4
  288.059822 27474.423828 23
  289.062788 1436.827148 1
  290.109274 822.392944 1
  292.014678 1473.759155 1
  292.744811 742.704956 1
  292.977744 5799.093262 5
  293.051658 1323.441772 1
  293.985575 2674.982178 2
  294.974685 1271.755127 1
  295.978416 897.388672 1
  295.983227 974.756470 1
  300.110811 771.195068 1
  301.030345 1676.111328 1
  303.006662 10554.842773 9
  303.229005 840.307373 1
  304.013643 7034.668457 6
  305.017601 1373.856201 1
  311.014436 4096.084473 3
  315.095620 3511.045166 3
  317.074645 21806.400391 18
  318.077588 2402.494873 2
  318.995935 1118.139404 1
  319.050840 4523.344238 4
  323.030536 2100.179443 2
  325.183485 1870.175537 2
  326.022667 1329.092407 1
  327.029287 1774.297119 2
  328.953964 9045.948242 8
  329.024989 16360.689453 14
  330.017238 1861.870117 2
  330.028566 905.895386 1
  330.951412 5363.251953 5
  331.021948 1753.084961 1
  333.039439 2364.571289 2
  336.333967 784.275269 1
  336.947782 1493.487427 1
  337.360658 897.620605 1
  337.796578 808.450562 1
  338.945487 876.185181 1
  339.056336 9771.129883 8
  340.041026 7196.315430 6
  341.043100 796.388794 1
  344.978562 1280.411133 1
  345.274131 962.499878 1
  347.032339 2173.797852 2
  348.971455 1726.876709 1
  349.012103 2920.209229 2
  351.693203 740.568237 1
  354.009844 851.350708 1
  355.040215 2764.961426 2
  357.020166 6204.801270 5
  358.022758 976.942749 1
  360.996387 1640.116333 1
  365.134296 1645.598999 1
  366.686794 873.092529 1
  385.595824 753.471802 1
  387.116682 2198.876709 2
  387.652551 812.337524 1
  388.073958 911.112793 1
  389.996284 800.403198 1
  390.015201 1215.264648 1
  402.247209 872.322510 1
  407.132115 1625.720459 1
  407.146083 4023.436523 3
  407.158501 10249.767578 9
  407.170919 402585.531250 341
  407.183337 9289.264648 8
  407.197309 4411.275391 4
  407.239227 1003.519775 1
  407.313765 1520.065674 1
  408.156845 1349.017090 1
  408.175541 83165.125000 70
  408.186447 1801.100098 2
  408.203587 720.147217 1
  408.206703 713.175171 1
  409.179194 7705.449707 7
  409.846174 810.133423 1
  417.993310 1084.892334 1
  423.088167 913.809937 1
  427.061964 6738.935547 6
  428.997695 1264.167603 1
  429.078286 1049.813354 1
  429.126987 3850.092773 3
  429.140424 12783.402344 11
  429.153861 428429.500000 363
  429.165619 9155.161133 8
  429.182416 3790.522949 3
  429.308431 1407.050293 1
  430.129725 1069.140259 1
  430.144893 2830.420410 2
  430.156692 89068.554688 75
  430.170177 1892.982666 2
  431.129214 25879.070313 22
  431.159658 6181.690430 5
  432.132191 6836.941895 6
  433.012670 1482.240479 1
  435.018184 1787.311035 2
  436.354907 971.943604 1
  440.702741 844.632813 1
  443.147713 15654.282227 13
  444.150500 4251.924805 4
  445.119434 5640.546875 5
  445.126531 6035.200684 5
  445.144275 3645.218750 3
  446.130706 901.716553 1
  451.135928 10701.083008 9
  451.724869 888.534668 1
  452.138722 3385.519531 3
  452.693231 928.684570 1
  459.094835 2726.825684 2
  461.089880 46816.601563 40
  462.092283 6327.130371 5
  462.099790 19038.150391 16
  462.114805 880.407349 1
  463.092311 2447.648193 2
  463.101725 6004.823730 5
  465.130556 2683.250488 2
  465.862985 814.210083 1
  467.104078 3462.396484 3
  468.101293 2242.561279 2
  469.084429 872.243652 1
  469.097865 33894.250000 29
  470.101475 6513.354004 6
  470.166956 1271.941895 1
  471.096717 1769.135498 1
  475.146637 1389.551636 1
  477.135085 2449.210693 2
  477.148869 852.136475 1
  478.138931 1553.424927 1
  483.577465 842.601440 1
  487.112653 6618.962891 6
  488.115566 2532.500732 2
  489.109317 2412.676758 2
  491.124449 7848.607910 7
  492.127406 3173.742920 3
  495.071523 1619.916626 1
  496.059464 2061.829590 2
  497.067115 46008.820313 39
  497.140404 8725.474609 7
  498.071538 8857.886719 7
  498.142949 1557.703125 1
  498.664294 944.677368 1
  499.064265 11084.803711 9
  499.076903 990.960083 1
  500.068413 3648.843018 3
  501.084071 1010.191162 1
  502.094323 2033.689697 2
  505.061981 3357.673584 3
  505.074848 1834.270508 2
  506.088595 3494.082275 3
  506.656938 863.359619 1
  507.057936 2837.437744 2
  507.073037 1493.172119 1
  507.096768 18605.708984 16
  508.099301 4854.996094 4
  509.104810 1021.684082 1
  513.108527 1473.293945 1
  514.106925 1316.947144 1
  515.103823 20566.974609 17
  516.105838 2796.463379 2
  516.826526 916.413818 1
  517.101894 2480.425049 2
  518.823474 831.577026 1
  519.049050 1691.695068 1
  521.160043 5013.770508 4
  523.141491 4435.949707 4
  524.085449 1023.620850 1
  528.320301 908.437378 1
  529.096623 989.459473 1
  534.105381 1017.881714 1
  537.300587 914.696167 1
  537.587772 835.108398 1
  541.120979 2633.580322 2
  541.218497 881.636841 1
  542.619953 896.621826 1
  544.216300 1145.464111 1
  545.350209 909.936523 1
  546.215027 1068.210938 1
  547.217313 1118.765137 1
  548.098699 5544.154297 5
  549.103745 1305.957642 1
  550.113996 1744.419922 1
  555.264169 2222.376465 2
  558.050681 1446.339233 1
  559.113209 992.551270 1
  563.300345 3157.690186 3
  565.085314 1871.134033 2
  565.128460 1797.334473 2
  571.290322 972.991333 1
  575.083355 3196.098633 3
  576.090412 1138.744629 1
  576.111312 851.696411 1
  582.008255 835.337891 1
  583.089424 2336.749512 2
  584.096257 877.972534 1
  588.322287 762.977905 1
  592.256537 1349.398560 1
  611.259972 39232.199219 33
  612.263389 14424.588867 12
  613.266408 2062.770752 2
  633.244195 13978.381836 12
  634.232839 1284.714233 1
  634.247927 5002.523926 4
  635.217750 4358.004395 4
  636.223148 1800.988037 2
  637.039514 810.745605 1
  637.106349 1080.614868 1
  649.207119 12989.394531 11
  650.211467 2465.176270 2
  655.223976 45346.261719 38
  656.229620 14704.009766 12
  657.234398 2028.302979 2
  662.177161 1030.315552 1
  663.185954 6813.166504 6
  664.174417 17839.263672 15
  664.193821 1364.514526 1
  665.155369 1728.112793 1
  665.181298 111521.914063 94
  665.207229 1413.324341 1
  665.985854 1043.169922 1
  666.157985 1143.081543 1
  666.183973 35544.140625 30
  667.179148 3305.407715 3
  667.188916 3571.306641 3
  668.183082 1204.742432 1
  668.614033 806.749756 1
  669.176201 1386.228149 1
  671.192090 3651.548828 3
  672.191928 4327.810059 4
  673.187402 50872.285156 43
  674.191703 17308.269531 15
  675.168422 1146.243896 1
  675.181680 1092.202759 1
  675.194939 3860.942871 3
  677.168187 987.028564 1
  677.208140 960.249390 1
  677.421281 819.161621 1
  680.556705 772.885620 1
  681.224695 9620.194336 8
  682.226842 3874.784180 3
  683.234577 942.173706 1
  686.155743 1560.107056 1
  687.161989 4939.016113 4
  691.198887 774.287598 1
  694.617299 849.834106 1
  695.171030 1071.880859 1
  700.149541 3652.653564 3
  702.145385 1600.017578 1
  706.180488 1691.994507 1
  709.143158 1004.476074 1
  710.178956 4120.482910 3
  711.177609 2004.056152 2
  713.184843 3231.909912 3
  713.350396 2637.893066 2
  714.352141 978.658569 1
  717.195857 982.332031 1
  721.841336 886.167603 1
  722.710504 838.373413 1
  723.140166 2933.341309 2
  723.213651 3631.555908 3
  725.135573 1455.491455 1
  725.249951 2189.672363 2
  731.145454 968.748169 1
  733.166609 5310.009766 4
  739.364170 1506.569824 1
  741.175478 2357.082275 2
  765.685191 841.720337 1
  776.817136 793.456055 1
  791.203969 997.064941 1
  815.704368 800.814331 1
  819.910789 749.366333 1
  827.836516 873.576782 1
  837.331535 1062.255005 1
  839.308015 22274.710938 19
  840.310385 12793.021484 11
  840.701704 832.260254 1
  841.314552 2536.912598 2
  853.299035 1399.999634 1
  856.197886 849.812866 1
  859.316142 7803.016602 7
  860.321206 4077.952637 3
  866.268345 2523.397949 2
  867.271158 1300.079834 1
  868.212877 1019.463745 1
  868.261211 58450.363281 49
  869.267487 28201.056641 24
  870.270663 7255.746094 6
  871.270718 1170.989258 1
  871.431081 1542.820190 1
  872.433137 1167.188843 1
  875.278439 4834.269043 4
  876.282239 2066.379639 2
  877.277949 1076.268066 1
  878.285192 1045.516602 1
  879.530671 901.186401 1
  881.297580 14033.273438 12
  882.301853 6649.688477 6
  883.302884 1328.988159 1
  890.242610 1764.284180 1
  891.252162 17796.322266 15
  892.253362 8971.202148 8
  893.029317 825.265259 1
  893.256249 2496.526611 2
  897.274599 994.609009 1
  898.265620 1432.236816 1
  899.258285 9335.978516 8
  900.262802 3964.484863 3
  905.980119 4527.707520 4
  906.980441 1095.806885 1
  913.231053 2311.859863 2
  913.742241 889.049805 1
  917.752680 955.170166 1
  926.220535 1577.084717 1
  926.470891 906.531494 1
  933.026716 996.578369 1
  935.519319 889.431885 1
  936.249563 1072.455688 1
  937.126985 1094.440063 1
  937.370932 891.182251 1
  937.793999 957.666992 1
  939.249801 1092.169556 1
  940.262164 1248.532959 1
  943.445952 1100.815430 1
  948.580373 1637.137695 1
  949.215452 1593.710938 1
  949.585749 1088.425903 1
  950.216305 1097.020996 1
  959.233902 1153.272217 1
  960.245024 1027.225952 1
  967.248489 1560.768066 1
  977.704708 863.257324 1
  978.554304 912.661011 1
  979.451337 918.829590 1
  1005.921012 1330.295166 1
  1005.969235 19332.501953 16
  1006.970641 2913.187256 2
  1035.131217 868.466309 1
  1037.557925 948.066284 1
  1042.417935 1409.602295 1
  1044.557724 916.154419 1
  1050.752885 820.738281 1
  1054.404613 813.350342 1
  1064.411082 1004.327271 1
  1065.402473 933.396118 1
  1065.994028 1712.016357 1
  1066.520268 936.338257 1
  1067.514608 1365.701538 1
  1070.049535 771.227295 1
  1073.443507 854.617798 1
  1077.421363 992.261353 1
  1081.683452 1496.353027 1
  1085.146476 1168.767700 1
  1085.382890 1783.312012 2
  1094.335251 3194.454590 3
  1095.341356 3734.122559 3
  1099.579428 799.759277 1
  1101.351978 2590.536621 2
  1105.902895 1208.091675 1
  1105.965432 19636.125000 17
  1106.869336 822.929077 1
  1106.966746 4395.677734 4
  1107.370437 3733.432617 3
  1108.373661 2938.023926 2
  1108.568891 872.686035 1
  1116.314862 1255.226440 1
  1117.323211 5912.892090 5
  1118.325862 4652.319336 4
  1120.328132 1153.106567 1
  1125.332432 4145.165527 4
  1126.338744 2467.282471 2
  1127.818542 918.175659 1
  1133.976184 1006.946167 1
  1136.295594 1106.406006 1
  1139.304769 1110.791016 1
  1143.471987 1019.735474 1
  1157.271196 878.826660 1
  1160.311861 1039.632935 1
  1161.851654 924.305908 1
  1165.985321 18428.939453 16
  1166.986407 4677.521973 4
  1167.988784 1060.118042 1
  1169.000004 1016.178833 1
  1175.277665 1312.952148 1
  1177.099101 964.816772 1
  1188.627996 810.328979 1
  1198.780790 940.737183 1
  1205.695580 1075.380005 1
  1205.909169 1076.898682 1
  1205.964553 10403.313477 9
  1206.962121 2438.361572 2
  1222.236838 932.704468 1
  1227.980748 1197.729370 1
  1233.969956 4801.020020 4
  1250.129250 1056.429565 1
  1250.630454 1054.091187 1
  1255.944988 2481.704346 2
  1261.217305 837.517334 1
  1265.978062 34041.062500 29
  1266.982865 9252.766602 8
  1267.980333 1028.485107 1
  1282.963258 1654.207031 1
  1283.970969 1400.798828 1
  1296.818157 884.235840 1
  1305.944986 1832.390137 2
  1317.803671 1015.660400 1
  1322.416135 1053.100586 1
  1327.427407 1290.392090 1
  1333.966349 9909.478516 8
  1334.961032 1448.704956 1
  1337.378688 991.884155 1
  1338.358690 1312.052856 1
  1339.376813 1286.093018 1
  1342.280199 898.860718 1
  1343.405125 2239.087402 2
  1344.391759 1878.398926 2
  1351.413208 1301.160645 1
  1353.348812 1110.448975 1
  1361.360692 1532.701416 1
  1365.974981 22372.755859 19
  1366.977040 7320.128418 6
  1367.875057 922.477051 1
  1380.880024 857.320557 1
  1425.104646 960.006470 1
  1425.724862 882.645874 1
  1433.958002 8900.740234 8
  1434.963914 1907.641846 2
  1449.419141 850.755737 1
  1452.489071 846.935303 1
  1452.593662 869.290039 1
  1461.789286 832.830078 1
  1461.831523 978.652222 1
  1464.167989 890.889404 1
  1465.969084 8983.460938 8
  1466.966411 3085.435303 3
  1467.954130 1307.745605 1
  1482.955151 1544.033081 1
  1487.768069 1258.206177 1