ACCESSION: MSBNK-Keio_Univ-KO002844
RECORD_TITLE: E-64; LC-ESI-QQ; MS2; CE:10 V; [M+H]+
DATE: 2016.01.19 (Created 2007.07.07, modified 2011.05.10)
AUTHORS: Kakazu Y, Horai H, Institute for Advanced Biosciences, Keio Univ.
LICENSE: CC BY-NC-SA
COMMENT: KEIO_ID E015

CH$NAME: E-64
CH$COMPOUND_CLASS: N/A
CH$FORMULA: C15H27N5O5
CH$EXACT_MASS: 357.20122
CH$SMILES: NC(=N)NCCCCNC(=O)C(CC(C)C)NC(=O)C(O1)C(C(O)=O)1
CH$IUPAC: InChI=1S/C15H27N5O5/c1-8(2)7-9(20-13(22)10-11(25-10)14(23)24)12(21)18-5-3-4-6-19-15(16)17/h8-11H,3-7H2,1-2H3,(H,18,21)(H,20,22)(H,23,24)(H4,16,17,19)
CH$LINK: CAS 66701-25-5
CH$LINK: CHEBI 30270
CH$LINK: CHEMPDB E64
CH$LINK: KEGG C01341
CH$LINK: NIKKAJI J22.188K
CH$LINK: PUBCHEM SID:4546
CH$LINK: INCHIKEY LTLYEAJONXGNFG-UHFFFAOYSA-N

AC$INSTRUMENT: API3000, Applied Biosystems
AC$INSTRUMENT_TYPE: LC-ESI-QQ
AC$MASS_SPECTROMETRY: MS_TYPE MS2
AC$MASS_SPECTROMETRY: ION_MODE POSITIVE
AC$MASS_SPECTROMETRY: COLLISION_ENERGY 10 V

MS$FOCUSED_ION: PRECURSOR_M/Z 358
MS$FOCUSED_ION: PRECURSOR_TYPE [M+H]+

PK$SPLASH: splash10-0a4i-0009000000-89041ad4cab19519bbd8
PK$NUM_PEAK: 17
PK$PEAK: m/z int. rel.int.
  73.900 59406.0 1
  142.400 14851.5 1
  148.200 396040.0 9
  176.100 39604.0 1
  192.300 297030.0 7
  197.300 19802.0 1
  205.900 29703.0 1
  207.500 14851.5 1
  211.400 49505.0 1
  224.900 29703.0 1
  232.500 44554.5 1
  237.800 39604.0 1
  298.300 79208.0 2
  322.400 163366.5 4
  323.100 79208.0 2
  341.100 386139.0 9
  358.600 43158459.0 999