ACCESSION: MSBNK-MSSJ-MSJ01042
RECORD_TITLE: EPTC; GC-EI-Q; MS; Positive
DATE: 2017.07.13 (Created 2016.12.16)
AUTHORS: Shimadzu Corporation., Kyoto, Japan
LICENSE: CC BY
COPYRIGHT: Shimadzu Cooperation., Kyoto, Japan
PUBLICATION: Shimadzu Collection of Pesticide GCMS Data

CH$NAME: EPTC
CH$NAME: S-Ethyl dipropylthiocarbamate
CH$COMPOUND_CLASS: Non-Natural Product; Pesticides
CH$FORMULA: C9H19NOS
CH$EXACT_MASS: 189.11873
CH$SMILES: CCCN(CCC)C(=O)SCC
CH$IUPAC: InChI=1S/C9H19NOS/c1-4-7-10(8-5-2)9(11)12-6-3/h4-8H2,1-3H3
CH$LINK: INCHIKEY GUVLYNGULCJVDO-UHFFFAOYSA-N
CH$LINK: PUBCHEM CID:12968
CH$LINK: COMPTOX DTXSID1024091

AC$INSTRUMENT: GCMS-QP2010 Plus, Shimadzu
AC$INSTRUMENT_TYPE: GC-EI-Q
AC$MASS_SPECTROMETRY: MS_TYPE MS
AC$MASS_SPECTROMETRY: ION_MODE POSITIVE
AC$MASS_SPECTROMETRY: IONIZATION EI
AC$CHROMATOGRAPHY: COLUMN_NAME Ptx-5MS(RESTEK), 0.32 mm I.D. x 30 m, df=0.25 microm
AC$CHROMATOGRAPHY: COLUMN_TEMPERATURE 80 C (1 min)-20 C/min - 180 C - 5 C/min - 330C (10 min)
AC$CHROMATOGRAPHY: INJECTION_TEMPERATURE 260 C
AC$CHROMATOGRAPHY: RETENTION_TIME 5.05 min

PK$SPLASH: splash10-0006-9400000000-45dcc511c4feeb1771fb
PK$NUM_PEAK: 33
PK$PEAK: m/z int. rel.int.
  40 8 8
  41 198 198
  42 95 95
  43 999 999
  44 48 48
  45 7 7
  47 10 10
  56 22 22
  58 39 39
  59 7 7
  60 4 4
  61 15 15
  62 17 17
  70 42 42
  71 5 5
  72 22 22
  75 42 42
  84 6 6
  86 395 395
  87 19 19
  89 96 96
  90 13 13
  100 22 22
  104 7 7
  128 575 575
  129 47 47
  132 132 132
  133 10 10
  134 6 6
  160 39 39
  161 5 5
  189 94 94
  190 11 11