ACCESSION: MSBNK-Nihon_Univ-NU000391
RECORD_TITLE: 2b,3a,12a-Trihydroxy-5b-cholan-24-oic acid; LC-ESI-TOF; MS; Negative; Orifice voltage -30 V
DATE: 2016.01.19 (Created 2014.12.05)
AUTHORS: Takashi Iida, Department of Chemistry, College of Humanities and Sciences, Nihon University
LICENSE: CC BY
COPYRIGHT: Copyright (C) Takashi Iida, Department of Chemistry, College of Humanities and Sciences, Nihon University
COMMENT: [Analytical] Sample of 1 micorL methanol solution was flow injected.
COMMENT: [Mass_spectrometry] Sampling interval 1 Hz

CH$NAME: 2b,3a,12a-Trihydroxy-5b-cholan-24-oic acid
CH$COMPOUND_CLASS: Natural Product; Bile acids
CH$FORMULA: C24H40O5
CH$EXACT_MASS: 408.28757
CH$SMILES: C[C@H](CCC(=O)O)[C@H]1CC[C@@H]2[C@@]1([C@H](C[C@H]3[C@H]2CC[C@H]4[C@@]3(C[C@@H]([C@H](C4)O)O)C)O)C
CH$IUPAC: InChI=1S/C24H40O5/c1-13(4-9-22(28)29)16-7-8-17-15-6-5-14-10-19(25)20(26)12-23(14,2)18(15)11-21(27)24(16,17)3/h13-21,25-27H,4-12H2,1-3H3,(H,28,29)/t13-,14-,15+,16-,17+,18+,19+,20+,21+,23+,24-/m1/s1
CH$LINK: CHEMSPIDER 4446950
CH$LINK: INCHIKEY JVRPXPQFLWKXPC-WLZJUEHXSA-N
CH$LINK: LIPIDBANK BBA0076
CH$LINK: PUBCHEM CID:5283862

AC$INSTRUMENT: JMS-T100LP, JEOL
AC$INSTRUMENT_TYPE: LC-ESI-TOF
AC$MASS_SPECTROMETRY: MS_TYPE MS
AC$MASS_SPECTROMETRY: ION_MODE NEGATIVE
AC$MASS_SPECTROMETRY: DESOLVATION_TEMPERATURE 250 C
AC$MASS_SPECTROMETRY: ION_GUIDE_VOLTAGE 1500 V
AC$MASS_SPECTROMETRY: IONIZATION ESI
AC$MASS_SPECTROMETRY: MASS_RANGE_M/Z 100-1000
AC$MASS_SPECTROMETRY: NEBULIZER N2
AC$MASS_SPECTROMETRY: NEEDLE_VOLTAGE -2000 V
AC$MASS_SPECTROMETRY: ORIFICE_TEMP 80 C
AC$MASS_SPECTROMETRY: ORIFICE_VOLTAGE -30 V
AC$MASS_SPECTROMETRY: RING_VOLTAGE -10

PK$SPLASH: splash10-03di-7910300000-5ab5990d3ada2fd5017f
PK$NUM_PEAK: 24
PK$PEAK: m/z int. rel.int.
  59.05156 2.4 24
  62.02455 3.9 39
  69.02414 36.2 362
  75.03551 39.2 392
  85.04744 3.0 30
  112.99695 100.0 999
  113.63035 0.9 9
  114.00118 2.5 25
  114.23404 0.6 6
  162.98263 0.5 5
  212.06989 4.7 47
  213.07517 1.2 12
  226.9812 4.2 42
  248.9575 5.6 56
  298.94487 2.7 27
  407.27257 29.3 293
  407.77224 1.3 13
  408.28413 8.1 81
  409.28501 1.3 13
  505.28248 1.9 19
  815.56913 1.5 15
  816.56235 0.9 9
  837.54235 1.2 12
  838.54885 0.7 7