ACCESSION: MSBNK-Nihon_Univ-NU000487
RECORD_TITLE: 3a,6a,7b-Trihydroxy-5b-cholan-24-oic acid; LC-ESI-TOF; MS; Orifice voltage -60 V; Negative; In-suorce decay
DATE: 2016.01.12
AUTHORS: Takashi Iida, Department of Chemistry, College of Humanities and Sciences, Nihon University
LICENSE: CC BY
COPYRIGHT: Copyright (C) Takashi Iida, Department of Chemistry, College of Humanities and Sciences, Nihon University
COMMENT: [Analytical] Sample of 1 micorL methanol solution was flow injected.
COMMENT: [Mass_spectrometry] Sampling interval 1 Hz
COMMENT: In-suorce decay

CH$NAME: 3a,6a,7b-Trihydroxy-5b-cholan-24-oic acid
CH$NAME: omega-Muricholic acid
CH$NAME: beta-Hyocholic acid
CH$COMPOUND_CLASS: Natural Product; Bile acid
CH$FORMULA: C24H40O5
CH$EXACT_MASS: 408.28757
CH$SMILES: C[C@H](CCC(=O)O)[C@H]1CC[C@@H]2[C@@]1(CC[C@H]3[C@H]2[C@H]([C@@H]([C@H]4[C@@]3(CC[C@H](C4)O)C)O)O)C
CH$IUPAC: InChI=1S/C24H40O5/c1-13(4-7-19(26)27)15-5-6-16-20-17(9-11-23(15,16)2)24(3)10-8-14(25)12-18(24)21(28)22(20)29/h13-18,20-22,25,28-29H,4-12H2,1-3H3,(H,26,27)/t13-,14-,15-,16+,17+,18+,20+,21-,22-,23-,24-/m1/s1
CH$LINK: CHEMSPIDER 4446939
CH$LINK: INCHIKEY DKPMWHFRUGMUKF-NTPBNISXSA-N
CH$LINK: LIPIDBANK BBA0065
CH$LINK: PUBCHEM CID:5283851
CH$LINK: COMPTOX DTXSID10415287

AC$INSTRUMENT: JMS-T100LP, JEOL
AC$INSTRUMENT_TYPE: LC-ESI-TOF
AC$MASS_SPECTROMETRY: MS_TYPE MS
AC$MASS_SPECTROMETRY: ION_MODE NEGATIVE
AC$MASS_SPECTROMETRY: DESOLVATION_TEMPERATURE 250 C
AC$MASS_SPECTROMETRY: ION_GUIDE_VOLTAGE 1500 V
AC$MASS_SPECTROMETRY: IONIZATION ESI
AC$MASS_SPECTROMETRY: MASS_RANGE_M/Z 100-1000
AC$MASS_SPECTROMETRY: NEBULIZER N2
AC$MASS_SPECTROMETRY: NEEDLE_VOLTAGE -2000 V
AC$MASS_SPECTROMETRY: ORIFICE_TEMP 80 C
AC$MASS_SPECTROMETRY: ORIFICE_VOLTAGE -60 V
AC$MASS_SPECTROMETRY: RING_VOLTAGE -10

PK$SPLASH: splash10-014i-9100300000-95926c33b695e736de5e
PK$NUM_PEAK: 24
PK$PEAK: m/z int. rel.int.
  59.02909 2.1 21
  61.00145 1.6 16
  62.00193 4.0 40
  69.00732 100.0 999
  69.54231 1.1 11
  70.00962 1.5 15
  73.01651 1.6 16
  78.96648 4.1 41
  112.98635 10.6 106
  125.00168 2.2 22
  153.03049 1.9 19
  154.97149 5.6 56
  186.99935 1.2 12
  248.95782 3.7 37
  407.2784 29.8 298
  408.28192 8.4 84
  409.28935 1.4 14
  439.30585 5.3 53
  440.31089 1.6 16
  461.29144 1.4 14
  815.56722 3.3 33
  816.58059 1.8 18
  837.55415 2.5 25
  838.56079 1.3 13