ACCESSION: MSBNK-Nihon_Univ-NU000491
RECORD_TITLE: 3a,6b,7a-Trihydroxy-5b-cholan-24-oic acid; LC-ESI-TOF; MS; Orifice voltage -30 V; Negative; In-suorce decay
DATE: 2016.01.12
AUTHORS: Takashi Iida, Department of Chemistry, College of Humanities and Sciences, Nihon University
LICENSE: CC BY
COPYRIGHT: Copyright (C) Takashi Iida, Department of Chemistry, College of Humanities and Sciences, Nihon University
COMMENT: [Analytical] Sample of 1 micorL methanol solution was flow injected.
COMMENT: [Mass_spectrometry] Sampling interval 1 Hz
COMMENT: In-suorce decay

CH$NAME: 3a,6b,7a-Trihydroxy-5b-cholan-24-oic acid
CH$NAME: alpha-Muricholic acid
CH$COMPOUND_CLASS: Natural Product; Bile acid
CH$FORMULA: C24H40O5
CH$EXACT_MASS: 408.28757
CH$SMILES: C[C@H](CCC(=O)O)[C@H]1CC[C@@H]2[C@@]1(CC[C@H]3[C@H]2[C@@H]([C@H]([C@H]4[C@@]3(CC[C@H](C4)O)C)O)O)C
CH$IUPAC: InChI=1S/C24H40O5/c1-13(4-7-19(26)27)15-5-6-16-20-17(9-11-23(15,16)2)24(3)10-8-14(25)12-18(24)21(28)22(20)29/h13-18,20-22,25,28-29H,4-12H2,1-3H3,(H,26,27)/t13-,14-,15-,16+,17+,18+,20+,21+,22+,23-,24-/m1/s1
CH$LINK: CHEMSPIDER 4446940
CH$LINK: INCHIKEY DKPMWHFRUGMUKF-GDYCBZMLSA-N
CH$LINK: LIPIDBANK BBA0066
CH$LINK: PUBCHEM CID:5283852

AC$INSTRUMENT: JMS-T100LP, JEOL
AC$INSTRUMENT_TYPE: LC-ESI-TOF
AC$MASS_SPECTROMETRY: MS_TYPE MS
AC$MASS_SPECTROMETRY: ION_MODE NEGATIVE
AC$MASS_SPECTROMETRY: DESOLVATION_TEMPERATURE 250 C
AC$MASS_SPECTROMETRY: ION_GUIDE_VOLTAGE 1500 V
AC$MASS_SPECTROMETRY: IONIZATION ESI
AC$MASS_SPECTROMETRY: MASS_RANGE_M/Z 100-1000
AC$MASS_SPECTROMETRY: NEBULIZER N2
AC$MASS_SPECTROMETRY: NEEDLE_VOLTAGE -2000 V
AC$MASS_SPECTROMETRY: ORIFICE_TEMP 80 C
AC$MASS_SPECTROMETRY: ORIFICE_VOLTAGE -30 V
AC$MASS_SPECTROMETRY: RING_VOLTAGE -10

PK$SPLASH: splash10-03di-4900100000-74b567c02797f5d0d11f
PK$NUM_PEAK: 21
PK$PEAK: m/z int. rel.int.
  59.02915 5.9 59
  62.00262 1.8 18
  69.00684 35.2 352
  75.01785 15.5 155
  89.0295 1.4 14
  112.98918 100.0 999
  113.64656 1.0 10
  113.99061 2.1 21
  153.03116 5.1 51
  166.9941 1.3 13
  226.97737 2.5 25
  248.95974 8.6 86
  384.94084 1.6 16
  407.28186 10.4 104
  408.28558 2.8 28
  439.30817 8.4 84
  440.31379 2.5 25
  611.43138 1.0 10
  815.57425 1.3 13
  816.58969 0.8 8
  837.56074 1.0 10