ACCESSION: MSBNK-Nihon_Univ-NU000605
RECORD_TITLE: 3a,6a,7b,12a-(OH)4-5a-cholanic acid; LC-ESI-TOF; MS; NEGATIVE; In source decay -150 V
DATE: 2018.02.20
AUTHORS: Takashi Iida, Department of Chemistry, College of Humanities and Sciences, Nihon University
LICENSE: CC BY
COPYRIGHT: Takashi Iida, Department of Chemistry, College of Humanities and Sciences, Nihon University
COMMENT: BA-101-150. In-source decay
COMMENT: 1 microL of the bile acid in MeOH solution was flow injected. Sampling interval was 1 Hz.
COMMENT: This record was created by the financial support of MEXT/JSPS KAKENHI Grant Number 17HP8021 (2017) to the MassBank database committee of the Mass Spectrometry Society of Japan.

CH$NAME: 3a,6a,7b,12a-(OH)4-5a-cholanic acid
CH$COMPOUND_CLASS: Natural Product; Bile acids
CH$FORMULA: C24H40O6
CH$EXACT_MASS: 424.28249
CH$SMILES: C(C23[H])(O)C(C(C(C2([H])CC(C(C([H])(C(C)CCC(O)=O)4)(C3([H])CC4)C)O)(C)1)([H])CC(O)CC1)O
CH$IUPAC: InChI=1S/C24H40O6/c1-12(4-7-19(27)28)14-5-6-15-20-16(11-18(26)24(14,15)3)23(2)9-8-13(25)10-17(23)21(29)22(20)30/h12-18,20-22,25-26,29-30H,4-11H2,1-3H3,(H,27,28)/t12-,13-,14-,15+,16+,17-,18+,20+,21-,22-,23-,24-/m1/s1
CH$LINK: CHEMSPIDER 4446991
CH$LINK: INCHIKEY COCMFMBNEAMQMA-OGAWIUPOSA-N
CH$LINK: LIPIDBANK BBA0124
CH$LINK: PUBCHEM CID:5283903

AC$INSTRUMENT: JMS-T100LP, JEOL
AC$INSTRUMENT_TYPE: LC-ESI-TOF
AC$MASS_SPECTROMETRY: MS_TYPE MS
AC$MASS_SPECTROMETRY: ION_MODE NEGATIVE
AC$MASS_SPECTROMETRY: IONIZATION ESI
AC$MASS_SPECTROMETRY: ORIFICE_TEMPERATURE 80 C
AC$MASS_SPECTROMETRY: ORIFICE_VOLTAGE -150 V
AC$MASS_SPECTROMETRY: SCAN_RANGE_M/Z 100-1000

PK$SPLASH: splash10-00di-0001900020-a297ddc82a074823764b
PK$NUM_PEAK: 35
PK$PEAK: m/z int. rel.int.
  285.22 4 41
  303.24 6 62
  341.25 6 62
  357.25 4 45
  359.26 10 103
  377.27 4 43
  423.27 100 999
  424.28 32 315
  425.30 6 57
  441.36 5 47
  459.25 13 132
  460.25 4 39
  461.25 5 49
  481.25 11 111
  483.25 4 37
  497.24 4 42
  536.39 7 70
  563.94 4 41
  594.63 4 40
  639.60 4 37
  659.21 4 41
  702.15 4 42
  707.19 6 55
  760.27 4 40
  810.97 4 44
  821.86 4 43
  847.59 10 104
  848.60 7 71
  869.55 15 147
  870.57 9 93
  883.56 4 36
  906.55 5 48
  911.70 4 42
  964.85 5 47
  988.44 4 37