ACCESSION: MSBNK-Nihon_Univ-NU000615
RECORD_TITLE: 3a,7a,14a-(OH)3-5b-cholanic acid; LC-ESI-TOF; MS; NEGATIVE; In source decay -150 V
DATE: 2018.02.20
AUTHORS: Takashi Iida, Department of Chemistry, College of Humanities and Sciences, Nihon University
LICENSE: CC BY
COPYRIGHT: Takashi Iida, Department of Chemistry, College of Humanities and Sciences, Nihon University
COMMENT: BA-103-150. In-source decay
COMMENT: 1 microL of the bile acid in MeOH solution was flow injected. Sampling interval was 1 Hz.
COMMENT: This record was created by the financial support of MEXT/JSPS KAKENHI Grant Number 17HP8021 (2017) to the MassBank database committee of the Mass Spectrometry Society of Japan.

CH$NAME: 3a,7a,14a-(OH)3-5b-cholanic acid
CH$NAME: 3alpha,7alpha,14alpha-Trihydroxy-5beta-cholane-24-oic acid
CH$COMPOUND_CLASS: Natural Product; Bile acids
CH$FORMULA: C24H40O5
CH$EXACT_MASS: 408.28757
CH$SMILES: C(C3(C)4)([H])(CC(O)CC4)CC(C(C3([H])2)(C(C1(C)CC2)(O)CCC1([H])C(C)CCC(O)=O)[H])O
CH$IUPAC: InChI=1S/C24H40O5/c1-14(4-5-20(27)28)17-8-11-24(29)21-18(7-10-23(17,24)3)22(2)9-6-16(25)12-15(22)13-19(21)26/h14-19,21,25-26,29H,4-13H2,1-3H3,(H,27,28)/t14-,15+,16-,17-,18+,19-,21+,22+,23-,24-/m1/s1
CH$LINK: CHEMSPIDER 10363042
CH$LINK: INCHIKEY OGSDYCPNYNWUNN-XJKBFLKTSA-N
CH$LINK: PUBCHEM CID:12112087

AC$INSTRUMENT: JMS-T100LP, JEOL
AC$INSTRUMENT_TYPE: LC-ESI-TOF
AC$MASS_SPECTROMETRY: MS_TYPE MS
AC$MASS_SPECTROMETRY: ION_MODE NEGATIVE
AC$MASS_SPECTROMETRY: IONIZATION ESI
AC$MASS_SPECTROMETRY: ORIFICE_TEMPERATURE 80 C
AC$MASS_SPECTROMETRY: ORIFICE_VOLTAGE -150 V
AC$MASS_SPECTROMETRY: SCAN_RANGE_M/Z 100-1000

PK$SPLASH: splash10-0a6s-6123900000-a02d2d9cc1b8209730a6
PK$NUM_PEAK: 40
PK$PEAK: m/z int. rel.int.
  64.02 24 242
  79.74 75 749
  80.77 15 155
  95.68 23 229
  96.67 3 32
  97.57 6 64
  127.27 4 36
  153.34 27 271
  154.34 3 34
  155.18 3 31
  184.12 2 23
  185.26 4 38
  226.99 8 80
  248.96 43 432
  249.96 3 27
  325.23 5 51
  327.24 2 23
  343.23 3 28
  345.25 4 42
  371.23 5 46
  384.91 2 24
  389.23 36 364
  390.24 11 113
  391.21 7 72
  393.21 4 45
  407.25 100 999
  408.25 31 307
  409.23 7 70
  411.22 22 223
  412.22 6 61
  421.25 3 35
  430.23 21 208
  431.24 4 44
  465.19 5 47
  480.23 7 70
  481.25 3 30
  521.21 4 45
  859.43 14 138
  861.43 3 26
  882.40 4 37