ACCESSION: MSBNK-RIKEN-PR020015
RECORD_TITLE: Eriodictyol; LC-ESI-QTOF; MS
DATE: 2016.01.19 (Created 2006.12.27, modified 2011.05.06)
AUTHORS: Tohge T, Plant Science Center, RIKEN.
LICENSE: CC BY-SA

CH$NAME: 3' 4' 5 7-tetrahydroxyflavanone
CH$NAME: Eriodictyol
CH$NAME: (2S)-2-(3,4-dihydroxyphenyl)-5,7-dihydroxy-chroman-4-one
CH$COMPOUND_CLASS: N/A
CH$FORMULA: C15H12O6
CH$EXACT_MASS: 288.06339
CH$SMILES: Oc(c3)c(O)cc(c3)[C@H](C1)Oc(c2)c(c(O)cc(O)2)C(=O)1
CH$IUPAC: InChI=1S/C15H12O6/c16-8-4-11(19)15-12(20)6-13(21-14(15)5-8)7-1-2-9(17)10(18)3-7/h1-5,13,16-19H,6H2/t13-/m0/s1
CH$LINK: CAS 552-58-9
CH$LINK: KEGG C05631
CH$LINK: NIKKAJI J139.243C
CH$LINK: PUBCHEM SID:7944 CID:440735
CH$LINK: INCHIKEY SBHXYTNGIZCORC-ZDUSSCGKSA-N
CH$LINK: COMPTOX DTXSID70877706

AC$INSTRUMENT: UPLC Q-Tof Premier, Waters
AC$INSTRUMENT_TYPE: LC-ESI-QTOF
AC$MASS_SPECTROMETRY: MS_TYPE MS
AC$MASS_SPECTROMETRY: ION_MODE POSITIVE
AC$MASS_SPECTROMETRY: COLLISION_ENERGY 5.0 V
AC$MASS_SPECTROMETRY: DATAFORMAT Centroid
AC$MASS_SPECTROMETRY: DESOLVATION_GAS_FLOW 600.0 L/Hr
AC$MASS_SPECTROMETRY: DESOLVATION_TEMPERATURE 350 C
AC$MASS_SPECTROMETRY: FRAGMENTATION_MODE LOW-ENERGY CID
AC$MASS_SPECTROMETRY: IONIZATION ESI
AC$MASS_SPECTROMETRY: SCANNING 0.6 sec/scan (m/z = 200-1200)
AC$MASS_SPECTROMETRY: SOURCE_TEMPERATURE 100 C
AC$CHROMATOGRAPHY: CAPILLARY_VOLTAGE 3.0 kV
AC$CHROMATOGRAPHY: COLUMN_NAME ACQUITY UPLC BEH C18 2.1 by 100 mm (Waters, Milford, MA,USA)
AC$CHROMATOGRAPHY: COLUMN_TEMPERATURE 35 C
AC$CHROMATOGRAPHY: FLOW_GRADIENT 0/100 at 0 min, 15/85 at 5 min, 21/79 at 20 min, 90/10 at 24 min, 95/5 at 26 min, 0/100, 30 min.
AC$CHROMATOGRAPHY: FLOW_RATE 0.5 ml/min
AC$CHROMATOGRAPHY: RETENTION_TIME 17.62 min
AC$CHROMATOGRAPHY: SAMPLING_CONE 23.0 V
AC$CHROMATOGRAPHY: SOLVENT A CH3CN(0.1%TFA)
AC$CHROMATOGRAPHY: SOLVENT B H2O(0.1%TFA)

MS$FOCUSED_ION: FULL_SCAN_FRAGMENT_ION_PEAK 289
MS$FOCUSED_ION: ION_TYPE [M+H]+
MS$DATA_PROCESSING: FIND_PEAK ignore rel.int. < 10
MS$DATA_PROCESSING: WHOLE MassLynx 4.1

PK$SPLASH: splash10-000i-0090000000-b946b40bb7aeb21fd6b6
PK$NUM_PEAK: 7
PK$PEAK: m/z int. rel.int.
  209.9915 9.304 11
  287.0606 49.17 60
  289.0730 823.9 999
  290.0987 142.0 172
  291.0291 24.16 29
  601.0848 11.41 14
  630.0521 29.43 36