ACCESSION: MSBNK-RIKEN-PR020043
RECORD_TITLE: Ononin; LC-ESI-QTOF; MS
DATE: 2016.01.19 (Created 2007.08.31, modified 2011.05.06)
AUTHORS: Tohge T, Plant Science Center, RIKEN.
LICENSE: CC BY-SA

CH$NAME: Formononetin-7-O-glucoside
CH$NAME: formononetin-7-O-glucoside
CH$NAME: 3-(4-methoxyphenyl)-7-[(2S,3R,4S,5R,6R)-3,4,5-trihydroxy-6-(hydroxymethyl)oxan-2-yl]oxy-chromen-4-one
CH$NAME: Ononin
CH$COMPOUND_CLASS: N/A
CH$FORMULA: C22H22O9
CH$EXACT_MASS: 430.12638
CH$SMILES: COc(c4)ccc(c4)C(=C3)C(=O)c(c2)c(O3)cc(c2)O[C@H](O1)[C@H](O)[C@@H](O)[C@H](O)[C@@H](CO)1
CH$IUPAC: InChI=1S/C22H22O9/c1-28-12-4-2-11(3-5-12)15-10-29-16-8-13(6-7-14(16)18(15)24)30-22-21(27)20(26)19(25)17(9-23)31-22/h2-8,10,17,19-23,25-27H,9H2,1H3/t17-,19-,20+,21-,22-/m1/s1
CH$LINK: CAS 486-62-4
CH$LINK: CHEBI 7775
CH$LINK: KEGG C10509
CH$LINK: NIKKAJI J12.916J
CH$LINK: PUBCHEM CID:442813
CH$LINK: INCHIKEY MGJLSBDCWOSMHL-MIUGBVLSSA-N
CH$LINK: COMPTOX DTXSID70964089

AC$INSTRUMENT: UPLC Q-Tof Premier, Waters
AC$INSTRUMENT_TYPE: LC-ESI-QTOF
AC$MASS_SPECTROMETRY: MS_TYPE MS
AC$MASS_SPECTROMETRY: ION_MODE POSITIVE
AC$MASS_SPECTROMETRY: COLLISION_ENERGY 5.0 V
AC$MASS_SPECTROMETRY: DATAFORMAT Centroid
AC$MASS_SPECTROMETRY: DESOLVATION_GAS_FLOW 600.0 L/Hr
AC$MASS_SPECTROMETRY: DESOLVATION_TEMPERATURE 350 C
AC$MASS_SPECTROMETRY: FRAGMENTATION_MODE LOW-ENERGY CID
AC$MASS_SPECTROMETRY: IONIZATION ESI
AC$MASS_SPECTROMETRY: SCANNING 0.6 sec/scan (m/z = 200-1200)
AC$MASS_SPECTROMETRY: SOURCE_TEMPERATURE 100 C
AC$CHROMATOGRAPHY: CAPILLARY_VOLTAGE 3.0 kV
AC$CHROMATOGRAPHY: COLUMN_NAME ACQUITY UPLC BEH C18 2.1 by 100 mm (Waters, Milford, MA,USA)
AC$CHROMATOGRAPHY: COLUMN_TEMPERATURE 35 C
AC$CHROMATOGRAPHY: FLOW_GRADIENT 0/100 at 0 min, 15/85 at 5 min, 21/79 at 20 min, 90/10 at 24 min, 95/5 at 26 min, 0/100, 30 min.
AC$CHROMATOGRAPHY: FLOW_RATE 0.5 ml/min
AC$CHROMATOGRAPHY: RETENTION_TIME 16.2 min
AC$CHROMATOGRAPHY: SAMPLING_CONE 23.0 V
AC$CHROMATOGRAPHY: SOLVENT A CH3CN(0.1%TFA)
AC$CHROMATOGRAPHY: SOLVENT B H2O(0.1%TFA)

MS$FOCUSED_ION: FULL_SCAN_FRAGMENT_ION_PEAK 431/269
MS$FOCUSED_ION: ION_TYPE [M+H]+
MS$DATA_PROCESSING: FIND_PEAK ignore rel.int. < 10
MS$DATA_PROCESSING: WHOLE MassLynx 4.1

PK$SPLASH: splash10-001i-0000900000-c2d377d0b3d5d4de46a7
PK$NUM_PEAK: 6
PK$PEAK: m/z int. rel.int.
  269.0883 777.6 109
  270.0974 126.0 18
  431.1317 7156 999
  432.1534 1140 159
  433.1426 198.3 28
  434.0737 76.60 11