ACCESSION: MSBNK-RIKEN-PR306184
RECORD_TITLE: Eriodictyol-7-O-rutinoside; LC-ESI-QTOF; MS2
DATE: 2019.03.28
AUTHORS: Tetsuya Mori, Center for Sustainable Resource Science, RIKEN
LICENSE: CC BY-NC-SA
PUBLICATION: Tsugawa H., Nakabayashi R., Mori T., Yamada Y., Takahashi M., Rai A., Sugiyama R., Yamamoto H., Nakaya T., Yamazaki M., Kooke R., Bac-Molenaar JA., Oztolan-Erol N., Keurentjes JJB., Arita M., Saito K. (2019) "A cheminformatics approach to characterize metabolomes in stable-isotope-labeled organisms" Nature Methods 16(4):295-298. [doi:10.1038/s41592-019-0358-2]
COMMENT: registered in RIKEN PlaSMA

CH$NAME: Eriodictyol-7-O-rutinoside
CH$COMPOUND_CLASS: Flavonoid-7-O-glycosides
CH$FORMULA: C27H32O15
CH$EXACT_MASS: 596.538
CH$SMILES: CC1OC(OCC2OC(OC3=CC(O)=C4C(=O)CC(OC4=C3)C3=CC(O)=C(O)C=C3)C(O)C(O)C2O)C(O)C(O)C1O
CH$IUPAC: InChI=1S/C27H32O15/c1-9-20(32)22(34)24(36)26(39-9)38-8-18-21(33)23(35)25(37)27(42-18)40-11-5-14(30)19-15(31)7-16(41-17(19)6-11)10-2-3-12(28)13(29)4-10/h2-6,9,16,18,20-30,32-37H,7-8H2,1H3
CH$LINK: INCHIKEY OMQADRGFMLGFJF-UHFFFAOYSA-N

AC$INSTRUMENT: LC, Waters Acquity UPLC System; MS, Waters Xevo G2 Q-Tof
AC$INSTRUMENT_TYPE: LC-ESI-QTOF
AC$MASS_SPECTROMETRY: MS_TYPE MS2
AC$MASS_SPECTROMETRY: ION_MODE NEGATIVE
AC$MASS_SPECTROMETRY: COLLISION_ENERGY 6V
AC$MASS_SPECTROMETRY: DESOLVATION_GAS_FLOW 800/h
AC$MASS_SPECTROMETRY: DESOLVATION_TEMPERATURE 450 C
AC$MASS_SPECTROMETRY: IONIZATION ESI
AC$CHROMATOGRAPHY: CAPILLARY_VOLTAGE -2.75 kV
AC$CHROMATOGRAPHY: COLUMN_NAME Acquity bridged ethyl hybrid C18 (1.7 um, 2.1 mm * 100 mm, Waters)
AC$CHROMATOGRAPHY: COLUMN_TEMPERATURE 40 C
AC$CHROMATOGRAPHY: FLOW_GRADIENT A/B = (99.5%/0.5% at 0 min, 99.5%/0.5% at 0.1 min, 20%/80% at 10 min, 0.5%/99.5% at 10.1 min, 0.5%/99.5% at 12.0 min, 99.5%/0.5% at 12.1 min, 99.5%/0.5% at 15.0 min)
AC$CHROMATOGRAPHY: FLOW_RATE 0.3 ml/min at 0 min, 0.3 ml/min at 10 min, 0.4 ml/min at 10.1 min, 0.4 ml/min at 14.4 min, 0.3 ml/min at 14.5 min
AC$CHROMATOGRAPHY: RETENTION_TIME 3.9209
AC$CHROMATOGRAPHY: SOLVENT A water including 0.1% formic acid
AC$CHROMATOGRAPHY: SOLVENT B acetonitrile including 0.1% formic acid

MS$FOCUSED_ION: PRECURSOR_TYPE [M-H]-
MS$FOCUSED_ION: PRECURSOR_M/Z 595.16684384783

PK$SPLASH: splash10-0udr-0900000000-fa2c35d9fe67e06d208b
PK$NUM_PEAK: 49
PK$PEAK: m/z int. rel.int.
  63.02216 9.0 9
  65.00224 8.0 8
  83.00871 14.0 14
  83.014 7.0 7
  97.03114 10.0 10
  107.0123 167.0 167
  108.01286 14.0 14
  108.02614 10.0 10
  108.99702 10.0 10
  109.0248 17.0 17
  119.04623 6.0 6
  121.02473 10.0 10
  121.03058 5.0 5
  125.02192 31.0 31
  126.02118 5.0 5
  129.03485 5.0 5
  131.01152 36.0 36
  135.0067 6.0 6
  135.01314 11.0 11
  135.04378 709.0 708
  136.04695 71.0 71
  136.05203 25.0 25
  137.02385 17.0 17
  137.05272 7.0 7
  145.06314 6.0 6
  147.04283 7.0 7
  149.02573 9.0 9
  151.0018 1000.0 999
  152.00412 62.0 62
  153.00673 12.0 12
  154.94878 5.0 5
  161.01657 13.0 13
  161.02278 13.0 13
  164.01865 6.0 6
  165.01585 11.0 11
  172.0524 14.0 14
  173.1273 6.0 6
  174.02545 6.0 6
  175.00203 33.0 33
  175.01044 19.0 19
  175.03758 13.0 13
  177.01451 6.0 6
  193.01295 7.0 7
  225.05446 10.0 10
  257.03809 6.0 6
  284.02426 12.0 12
  285.03812 39.0 39
  286.03696 16.0 16
  287.04062 7.0 7