ACCESSION: MSBNK-RIKEN_ReSpect-PT107310
RECORD_TITLE: trans-Zeatin, (E)-2-methyl-4-(7H-purin-6-ylamino)but-2-en-1-ol, N6-(4-Hydroxy-3-methyl-2-buten-1-yl)adenine , 6-(4-Hydroxy-3-methylbut-2-enylamino)purine, ZEE; LC-ESI-QTOF; MS2
DATE: 2008.07.28
AUTHORS: Matsuda F, Suzuki M, Sawada Y, Plant Science Center, RIKEN.
LICENSE: CC BY-NC
COPYRIGHT: Copyright(C) 2009 Plant Science Center, RIKEN
COMMENT: Build 1 2009/06/24
COMMENT: Acquisition and generation of the data is financially supported in part by CREST/JST.

CH$NAME: trans-Zeatin
CH$NAME: (E)-2-methyl-4-(7H-purin-6-ylamino)but-2-en-1-ol
CH$NAME: N6-(4-Hydroxy-3-methyl-2-buten-1-yl)adenine
CH$NAME: 6-(4-Hydroxy-3-methylbut-2-enylamino)purine
CH$NAME: ZEE
CH$COMPOUND_CLASS: CLASS1 Other CLASS2 Nucleoside CLASS3 Zeatin
CH$FORMULA: C10H13N5O
CH$EXACT_MASS: 219.248
CH$SMILES: CC(=CCNC1=NC=NC2=C1NC=N2)CO
CH$IUPAC: InChI=1S/C10H13N5O/c1-7(4-16)2-3-11-9-8-10(13-5-12-8)15-6-14-9/h2,5-6,16H,3-4H2,1H3,(H2,11,12,13,14,15)
CH$LINK: CAS 1637-39-4
CH$LINK: INCHIKEY UZKQTCBAMSWPJD-UHFFFAOYSA-N

AC$INSTRUMENT: Q-Tof Premier, Waters
AC$INSTRUMENT_TYPE: LC-ESI-QTOF
AC$MASS_SPECTROMETRY: MS_TYPE MS2
AC$MASS_SPECTROMETRY: ION_MODE POSITIVE
AC$MASS_SPECTROMETRY: IONIZATION ESI
AC$MASS_SPECTROMETRY: COLLISION_ENERGY Ramp 5-45 V
AC$MASS_SPECTROMETRY: CAPILLARY_VOLTAGE 3.0 kV
AC$CHROMATOGRAPHY: SOLVENT CH3CN/H2O

MS$FOCUSED_ION: ION_TYPE [M+H]+
MS$FOCUSED_ION: PRECURSOR_M/Z 220.1198

PK$SPLASH: splash10-000i-0940000000-cb0bbc57cc639674a102
PK$NUM_PEAK: 6
PK$PEAK: m/z int. rel.int.
  119.0369 220.0 160
  136.0629 1374.0 999
  148.0634 201.2 146
  185.0829 85.88 62
  202.1102 248.0 180
  220.1198 663.5 482