ACCESSION: MSBNK-CASMI_2016-SM816753
RECORD_TITLE: 2,4,6-Tribromphenol; LC-ESI-QFT; MS2; CE: 35 NCE; R=35000; [M-H]-
DATE: 2016.12.12
AUTHORS: Krauss M, Schymanski EL, Weidauer C, Schupke H, UFZ and Eawag
LICENSE: CC BY
COPYRIGHT: Copyright (C) 2016 UFZ/Eawag
PUBLICATION: Schymanski, E. L.; Ruttkies, C.; Krauss, M.; Brouard, C.; Kind, T.; Dührkop, K.; Allen, F.; Vaniya, A.; Verdegem, D.; Böcker, S.; et al. Critical Assessment of Small Molecule Identification 2016: Automated Methods. Journal of Cheminformatics 2017, 9 (1). DOI:10.1186/s13321-017-0207-1
COMMENT: CONFIDENCE Reference Standard (Level 1)
COMMENT: INTERNAL_ID 8167

CH$NAME: 2,4,6-Tribromphenol
CH$COMPOUND_CLASS: N/A; Environmental Standard
CH$FORMULA: C6H3Br3O
CH$EXACT_MASS: 327.77340
CH$SMILES: OC1=C(Br)C=C(Br)C=C1Br
CH$IUPAC: InChI=1S/C6H3Br3O/c7-3-1-4(8)6(10)5(9)2-3/h1-2,10H
CH$LINK: CAS 118-79-6
CH$LINK: CHEBI 47696
CH$LINK: KEGG C14454
CH$LINK: PUBCHEM CID:1483
CH$LINK: INCHIKEY BSWWXRFVMJHFBN-UHFFFAOYSA-N
CH$LINK: CHEMSPIDER 1438
CH$LINK: COMPTOX DTXSID6021959

AC$INSTRUMENT: Q Exactive Plus Orbitrap Thermo Scientific
AC$INSTRUMENT_TYPE: LC-ESI-QFT
AC$MASS_SPECTROMETRY: MS_TYPE MS2
AC$MASS_SPECTROMETRY: ION_MODE NEGATIVE
AC$MASS_SPECTROMETRY: IONIZATION ESI
AC$MASS_SPECTROMETRY: FRAGMENTATION_MODE HCD
AC$MASS_SPECTROMETRY: COLLISION_ENERGY 35 (nominal)
AC$MASS_SPECTROMETRY: RESOLUTION 35000
AC$CHROMATOGRAPHY: COLUMN_NAME Kinetex C18 EVO 2.6 um, 2.1x50 mm, precolumn 2.1x5 mm, Phenomenex
AC$CHROMATOGRAPHY: FLOW_GRADIENT 95/5 at 0 min, 95/5 at 1 min, 0/100 at 13 min, 0/100 at 24 min
AC$CHROMATOGRAPHY: FLOW_RATE 300 uL/min
AC$CHROMATOGRAPHY: RETENTION_TIME 11.937 min
AC$CHROMATOGRAPHY: SOLVENT A water with 0.1% formic acid
AC$CHROMATOGRAPHY: SOLVENT B methanol with 0.1% formic acid

MS$FOCUSED_ION: BASE_PEAK 328.7642
MS$FOCUSED_ION: PRECURSOR_M/Z 326.7661
MS$FOCUSED_ION: PRECURSOR_TYPE [M-H]-
MS$DATA_PROCESSING: RECALIBRATE loess on assigned fragments and MS1
MS$DATA_PROCESSING: REANALYZE Peaks with additional N2/O included
MS$DATA_PROCESSING: WHOLE RMassBank 2.3.1

PK$SPLASH: splash10-004i-0009000000-d4bc5a4018393fbac0dd
PK$ANNOTATION: m/z tentative_formula formula_count mass error(ppm)
  266.7534 Br3NO- 1 266.7535 -0.74
  326.7662 C6H2Br3O- 1 326.7661 0.13
PK$NUM_PEAK: 2
PK$PEAK: m/z int. rel.int.
  266.7534 2904.2 4
  326.7662 659108.7 999