ACCESSION: MSBNK-Univ_Toyama-TY000149
RECORD_TITLE: Myricetin; LC-ESI-ITTOF; MS; [M+H]+
DATE: 2016.01.19 (Created 2010.10.14, modified 2011.05.06)
AUTHORS: Toshimitsu HAYASHI, Ken TANAKA
LICENSE: CC BY-SA

CH$NAME: Myricetin
CH$NAME: 3,5,7-Trihydroxy-2-(3,4,5-trihydroxyphenyl)-4H-1-benzopyran-4-one
CH$NAME: 3,3',4',5,5',7-Hexahydroxy-flavone
CH$NAME: 3,3',4',5,5',7-Hexahydroxyflavone
CH$NAME: 3,5,7,3',4',5'-Hexahydroxyflavone
CH$NAME: Cannabiscetin
CH$NAME: Myricetol
CH$COMPOUND_CLASS: Natural Product; Flavonoid
CH$FORMULA: C15H10O8
CH$EXACT_MASS: 318.03757
CH$SMILES: Oc(c3)cc(O1)c(c(O)3)C(=O)C(O)=C1c(c2)cc(O)c(O)c(O)2
CH$IUPAC: InChI=1S/C15H10O8/c16-6-3-7(17)11-10(4-6)23-15(14(22)13(11)21)5-1-8(18)12(20)9(19)2-5/h1-4,16-20,22H
CH$LINK: CAS 529-44-2
CH$LINK: INCHIKEY IKMDFBPHZNJCSN-UHFFFAOYSA-N
CH$LINK: COMPTOX DTXSID8022400

AC$INSTRUMENT: LCMS-IT-TOF
AC$INSTRUMENT_TYPE: LC-ESI-ITTOF
AC$MASS_SPECTROMETRY: MS_TYPE MS
AC$MASS_SPECTROMETRY: ION_MODE POSITIVE
AC$MASS_SPECTROMETRY: CDL_TEMPERATURE 200 C
AC$MASS_SPECTROMETRY: INTERFACE_VOLTAGE +4.50 kV
AC$MASS_SPECTROMETRY: SCANNING 0.1 sec/scan (m/z = 200-2000)
AC$CHROMATOGRAPHY: COLUMN_NAME Waters Atlantis T3 (2.1 x 150 mm, 5 um)
AC$CHROMATOGRAPHY: COLUMN_TEMPERATURE 40 C
AC$CHROMATOGRAPHY: FLOW_GRADIENT 10 % B to 100 % B/40 min
AC$CHROMATOGRAPHY: FLOW_RATE 0.2 ml/min
AC$CHROMATOGRAPHY: RETENTION_TIME 12.835000 min
AC$CHROMATOGRAPHY: SOLVENT A 5 mM ammonium acetate
AC$CHROMATOGRAPHY: SOLVENT B CH3CN

MS$FOCUSED_ION: BASE_PEAK 319.044700

PK$SPLASH: splash10-014i-0009000000-53a8ef15995d43417d39
PK$NUM_PEAK: 92
PK$PEAK: m/z int. rel.int.
  202.927600 4498.000000 3
  218.208000 4498.000000 3
  226.461000 4498.000000 3
  227.112200 4498.000000 3
  245.048400 4498.000000 3
  252.139000 4498.000000 3
  264.072100 10843.000000 8
  269.266200 4498.000000 3
  273.032200 8615.000000 6
  282.529400 4498.000000 3
  287.037600 8615.000000 6
  289.256000 4498.000000 3
  290.041000 4498.000000 3
  301.043000 8615.000000 6
  302.044200 4498.000000 3
  303.063800 8615.000000 6
  317.056700 19972.000000 14
  318.067000 4498.000000 3
  318.650000 4498.000000 3
  319.044700 1404673.000000 999
  319.216300 23576.000000 17
  319.370900 30617.000000 22
  319.594200 22051.000000 16
  319.783200 8615.000000 6
  320.041000 224736.000000 160
  321.038800 28588.000000 20
  322.038300 8615.000000 6
  323.194700 4498.000000 3
  337.586700 4498.000000 3
  339.018400 14960.000000 11
  351.282900 4498.000000 3
  394.253500 4498.000000 3
  410.989600 8234.000000 6
  412.979100 8615.000000 6
  415.992000 4498.000000 3
  434.840200 4498.000000 3
  502.987200 4498.000000 3
  504.777600 4498.000000 3
  539.913200 4498.000000 3
  559.923500 4498.000000 3
  574.755400 4498.000000 3
  583.891500 4498.000000 3
  605.426200 4498.000000 3
  606.064800 4498.000000 3
  633.044100 4498.000000 3
  651.062400 34744.000000 25
  652.068100 8615.000000 6
  653.050000 4498.000000 3
  657.059000 4498.000000 3
  671.398700 4498.000000 3
  685.113200 4498.000000 3
  689.042700 4498.000000 3
  690.001500 42217.000000 30
  690.658000 4498.000000 3
  691.011600 16999.000000 12
  691.997100 4498.000000 3
  725.146500 4498.000000 3
  737.568700 4498.000000 3
  749.017700 4498.000000 3
  751.887100 4498.000000 3
  766.795500 4498.000000 3
  816.100800 4498.000000 3
  822.068900 4498.000000 3
  841.998700 4498.000000 3
  931.716100 4498.000000 3
  1004.175500 4498.000000 3
  1008.016100 12733.000000 9
  1024.989700 4498.000000 3
  1056.829900 4498.000000 3
  1061.990900 4498.000000 3
  1091.664100 4498.000000 3
  1098.055300 4498.000000 3
  1183.434300 4498.000000 3
  1265.847700 4498.000000 3
  1348.104800 4498.000000 3
  1378.762100 4498.000000 3
  1409.836400 4498.000000 3
  1424.814100 4498.000000 3
  1458.674700 4498.000000 3
  1544.461700 4498.000000 3
  1545.557100 4498.000000 3
  1556.342900 4498.000000 3
  1569.944500 4498.000000 3
  1790.411100 4498.000000 3
  1827.563700 4498.000000 3
  1860.038100 4498.000000 3
  1877.319300 4498.000000 3
  1890.081900 4498.000000 3
  1904.774600 4498.000000 3
  1905.949200 4498.000000 3
  1948.600300 4498.000000 3
  1980.289000 4498.000000 3