ACCESSION: MSBNK-Univ_Toyama-TY000214
RECORD_TITLE: Iridin; LC-ESI-ITTOF; MS; [M-H]-
DATE: 2016.01.19 (Created 2010.10.15, modified 2011.05.06)
AUTHORS: Toshimitsu HAYASHI, Ken TANAKA
LICENSE: CC BY-SA

CH$NAME: Iridin
CH$NAME: 7-(beta-D-Glucopyranosyloxy)-5-hydroxy-3-(3-hydroxy-4,5-dimethoxyphenyl)-6-methoxy-4H-1-benzopyran-4-one
CH$NAME: Irigenin 7-glucoside
CH$NAME: Irigenin 7-beta-D-glucopyranoside
CH$NAME: Irigenin-7-O-beta-D-glucopyranoside
CH$COMPOUND_CLASS: Natural Product; Flavonoid
CH$FORMULA: C24H26O13
CH$EXACT_MASS: 522.13734
CH$SMILES: OCC(O1)C(O)C(O)C(O)C1Oc(c2)c(OC)c(O)c(C(=O)3)c(OC=C(c(c4)cc(OC)c(OC)c(O)4)3)2
CH$IUPAC: InChI=1S/C24H26O13/c1-32-13-5-9(4-11(26)22(13)33-2)10-8-35-12-6-14(23(34-3)19(29)16(12)17(10)27)36-24-21(31)20(30)18(28)15(7-25)37-24/h4-6,8,15,18,20-21,24-26,28-31H,7H2,1-3H3/t15-,18-,20+,21-,24-/m1/s1
CH$LINK: CAS 491-74-7
CH$LINK: INCHIKEY LNQCUTNLHUQZLR-OZJWLQQPSA-N
CH$LINK: COMPTOX DTXSID80197689

AC$INSTRUMENT: LCMS-IT-TOF
AC$INSTRUMENT_TYPE: LC-ESI-ITTOF
AC$MASS_SPECTROMETRY: MS_TYPE MS
AC$MASS_SPECTROMETRY: ION_MODE NEGATIVE
AC$MASS_SPECTROMETRY: CDL_TEMPERATURE 200 C
AC$MASS_SPECTROMETRY: INTERFACE_VOLTAGE -3.50 kV
AC$MASS_SPECTROMETRY: SCANNING 0.1 sec/scan (m/z = 200-2000)
AC$CHROMATOGRAPHY: COLUMN_NAME Waters Atlantis T3 (2.1 x 150 mm, 5 um)
AC$CHROMATOGRAPHY: COLUMN_TEMPERATURE 40 C
AC$CHROMATOGRAPHY: FLOW_GRADIENT 10 % B to 100 % B/40 min
AC$CHROMATOGRAPHY: FLOW_RATE 0.2 ml/min
AC$CHROMATOGRAPHY: RETENTION_TIME 12.776667 min
AC$CHROMATOGRAPHY: SOLVENT A 5 mM ammonium acetate
AC$CHROMATOGRAPHY: SOLVENT B CH3CN

MS$FOCUSED_ION: BASE_PEAK 521.135500

PK$SPLASH: splash10-00ec-3001091100-462a063c5da815e689a8
PK$NUM_PEAK: 103
PK$PEAK: m/z int. rel.int.
  232.746100 104616.000000 5
  234.862000 104616.000000 5
  247.803800 104616.000000 5
  255.440400 104616.000000 5
  287.341300 104616.000000 5
  301.020500 104616.000000 5
  312.991400 104616.000000 5
  326.097400 104616.000000 5
  339.507700 104616.000000 5
  343.040400 200367.000000 10
  344.055700 349472.000000 18
  355.612300 104616.000000 5
  359.082000 3568733.000000 184
  360.066000 404741.000000 21
  361.087800 253721.000000 13
  363.319000 104616.000000 5
  367.746800 104616.000000 5
  371.052800 104616.000000 5
  372.572200 200367.000000 10
  435.735500 104616.000000 5
  446.716200 104616.000000 5
  467.340700 200367.000000 10
  500.525100 104616.000000 5
  506.108800 457227.000000 24
  521.135500 19383176.000000 999
  521.530400 389510.000000 20
  521.837700 253721.000000 13
  522.123100 5034480.000000 259
  522.474500 104616.000000 5
  523.133600 677400.000000 35
  524.123100 253721.000000 13
  531.540900 104616.000000 5
  551.125400 200367.000000 10
  557.097100 200367.000000 10
  558.095500 200367.000000 10
  559.094800 200367.000000 10
  581.143500 9362799.000000 483
  581.908200 164903.000000 8
  582.163200 2381300.000000 123
  583.160600 398304.000000 21
  584.112400 3017014.000000 155
  585.134800 550282.000000 28
  586.111500 200367.000000 10
  589.326300 104616.000000 5
  607.828400 104616.000000 5
  626.736800 104616.000000 5
  635.112500 4887272.000000 252
  635.621100 104616.000000 5
  636.130000 1237612.000000 64
  637.099900 200367.000000 10
  660.647200 104616.000000 5
  663.490700 104616.000000 5
  702.819900 104616.000000 5
  733.931900 104616.000000 5
  750.661800 104616.000000 5
  767.207500 104616.000000 5
  782.185700 1398721.000000 72
  782.696400 3184985.000000 164
  783.207300 912290.000000 47
  783.691500 402826.000000 21
  874.186600 104616.000000 5
  881.218700 2440223.000000 126
  882.217400 1290966.000000 67
  883.216700 253721.000000 13
  897.525100 104616.000000 5
  1038.211800 104616.000000 5
  1043.264900 5584904.000000 288
  1043.761600 2687383.000000 139
  1044.258400 4027449.000000 208
  1044.755300 1349889.000000 70
  1045.252300 845602.000000 44
  1046.246800 253721.000000 13
  1054.749600 104616.000000 5
  1081.222700 200367.000000 10
  1122.947900 104616.000000 5
  1189.866100 104616.000000 5
  1265.514600 104616.000000 5
  1304.334600 164903.000000 8
  1304.820500 668268.000000 34
  1305.341200 565123.000000 29
  1305.792600 302554.000000 16
  1332.317000 104616.000000 5
  1352.385300 104616.000000 5
  1356.558600 104616.000000 5
  1383.877100 104616.000000 5
  1462.942400 104616.000000 5
  1524.554800 104616.000000 5
  1543.826300 104616.000000 5
  1545.223700 104616.000000 5
  1564.739000 104616.000000 5
  1565.385300 296117.000000 15
  1567.477100 104616.000000 5
  1596.717400 104616.000000 5
  1639.508500 104616.000000 5
  1665.760700 104616.000000 5
  1755.096600 104616.000000 5
  1766.710400 104616.000000 5
  1822.399300 104616.000000 5
  1857.353800 104616.000000 5
  1882.703500 104616.000000 5
  1889.965800 104616.000000 5
  1906.042600 104616.000000 5
  1962.166600 104616.000000 5