ACCESSION: MSBNK-Waters-WA000366
RECORD_TITLE: Triazolam; LC-ESI-Q; MS; POS; 15 V, 30 V
DATE: 2016.01.19 (Created 2007.08.01, modified 2011.05.06)
AUTHORS: Nihon Waters K.K.
LICENSE: CC BY-NC

CH$NAME: Triazolam
CH$COMPOUND_CLASS: N/A
CH$FORMULA: C17H12Cl2N4
CH$EXACT_MASS: 342.04390
CH$SMILES: Clc(c3)cc(C=1c(c4)c(Cl)ccc4)c(c3)n(c(C)2)c(nn2)CN1
CH$IUPAC: InChI=1S/C17H12Cl2N4/c1-10-21-22-16-9-20-17(12-4-2-3-5-14(12)19)13-8-11(18)6-7-15(13)23(10)16/h2-8H,9H2,1H3
CH$LINK: CAS 28911-01-5
CH$LINK: INCHIKEY JOFWLTCLBGQGBO-UHFFFAOYSA-N
CH$LINK: COMPTOX DTXSID6046763

AC$INSTRUMENT: ZQ, Waters
AC$INSTRUMENT_TYPE: LC-ESI-Q
AC$MASS_SPECTROMETRY: MS_TYPE MS
AC$MASS_SPECTROMETRY: ION_MODE POSITIVE
AC$MASS_SPECTROMETRY: IONIZATION ESI
AC$CHROMATOGRAPHY: RETENTION_TIME 15.300 min
AC$CHROMATOGRAPHY: COLUMN_NAME 2.1 mm id - 3. 5{mu}m XTerra C18MS
AC$CHROMATOGRAPHY: COLUMN_TEMPERATURE 35 C
AC$CHROMATOGRAPHY: SAMPLING_CONE 15 V, 30 V

MS$DATA_PROCESSING: FIND_PEAK ignore rel.int. < 5

PK$SPLASH: splash10-0007-0009000000-ab11c2b0897223af5a24
PK$NUM_PEAK: 7
PK$PEAK: m/z int. rel.int.
  343 999 999
  345 658 658
  346 129 129
  347 118 118
  348 20 20
  365 20 20
  367 12 12