ACCESSION: MSBNK-Waters-WA000640
RECORD_TITLE: Sufentanil; LC-ESI-Q; MS; POS; 75 V, 90 V
DATE: 2016.01.19 (Created 2007.08.01, modified 2011.05.06)
AUTHORS: Nihon Waters K.K.
LICENSE: CC BY-NC

CH$NAME: Sufentanil
CH$COMPOUND_CLASS: N/A
CH$FORMULA: C22H30N2O2S
CH$EXACT_MASS: 386.20280
CH$SMILES: COCC(C2)(CCN(CCc(c3)scc3)C2)N(C(=O)CC)c(c1)cccc1
CH$IUPAC: InChI=1S/C22H30N2O2S/c1-3-21(25)24(19-8-5-4-6-9-19)22(18-26-2)12-15-23(16-13-22)14-11-20-10-7-17-27-20/h4-10,17H,3,11-16,18H2,1-2H3
CH$LINK: CAS 56030-54-7
CH$LINK: INCHIKEY GGCSSNBKKAUURC-UHFFFAOYSA-N
CH$LINK: COMPTOX DTXSID6023604

AC$INSTRUMENT: ZQ, Waters
AC$INSTRUMENT_TYPE: LC-ESI-Q
AC$MASS_SPECTROMETRY: MS_TYPE MS
AC$MASS_SPECTROMETRY: ION_MODE POSITIVE
AC$MASS_SPECTROMETRY: IONIZATION ESI
AC$CHROMATOGRAPHY: RETENTION_TIME 14.580 min
AC$CHROMATOGRAPHY: COLUMN_NAME 2.1 mm id - 3. 5{mu}m XTerra C18MS
AC$CHROMATOGRAPHY: COLUMN_TEMPERATURE 35 C
AC$CHROMATOGRAPHY: SAMPLING_CONE 75 V, 90 V

MS$DATA_PROCESSING: FIND_PEAK ignore rel.int. < 5

PK$SPLASH: splash10-03di-0910000000-cb24649d08f8334b7112
PK$NUM_PEAK: 31
PK$PEAK: m/z int. rel.int.
  104 8 8
  105 8 8
  106 20 20
  108 86 86
  109 20 20
  110 20 20
  111 999 999
  112 47 47
  113 47 47
  118 24 24
  123 8 8
  126 86 86
  127 8 8
  128 8 8
  132 188 188
  133 16 16
  140 141 141
  141 12 12
  144 8 8
  150 20 20
  152 16 16
  158 8 8
  160 27 27
  178 8 8
  206 63 63
  208 8 8
  214 12 12
  224 39 39
  238 74 74
  239 8 8
  355 20 20